[phpMyAdmin Developers] Build failed in Jenkins: website #613

classic Classic list List threaded Threaded
2 messages Options
Reply | Threaded
Open this post in threaded view
|

[phpMyAdmin Developers] Build failed in Jenkins: website #613

Jenkins Daemon
See <https://ci.phpmyadmin.net/job/website/613/display/redirect?page=changes>

Changes:

[Michal Čihař] Add new bronze sponsor

------------------------------------------
Started by GitHub push by nijel
[EnvInject] - Loading node environment variables.
Building in workspace <https://ci.phpmyadmin.net/job/website/ws/>
 > git rev-parse --is-inside-work-tree # timeout=10
Fetching changes from the remote Git repository
 > git config remote.origin.url https://github.com/phpmyadmin/website.git # timeout=10
Fetching upstream changes from https://github.com/phpmyadmin/website.git
 > git --version # timeout=10
 > git fetch --tags --progress https://github.com/phpmyadmin/website.git +refs/heads/*:refs/remotes/origin/*
 > git rev-parse origin/master^{commit} # timeout=10
Checking out Revision 2d5d96cf57930a4b01cc7f1b5a31b1815e716ac1 (origin/master)
Commit message: "Add new bronze sponsor"
 > git config core.sparsecheckout # timeout=10
 > git checkout -f 2d5d96cf57930a4b01cc7f1b5a31b1815e716ac1
 > git rev-list 9648625d72f3452af8b6cd7535553453905d1b13 # timeout=10
[workspace] $ ant build
Unable to locate tools.jar. Expected to find it in /usr/lib/jvm/java-8-openjdk-amd64/lib/tools.jar
Buildfile: <https://ci.phpmyadmin.net/job/website/ws/build.xml>

clean:
   [delete] Deleting directory <https://ci.phpmyadmin.net/job/website/ws/build>
    [mkdir] Created dir: <https://ci.phpmyadmin.net/job/website/ws/build>

test:
     [exec] .................
     [exec] ----------------------------------------------------------------------
     [exec] Ran 17 tests in 13.776s
     [exec]
     [exec] OK
     [exec] Creating test database for alias 'default'...
     [exec] Destroying test database for alias 'default'...

jshint:

csslint:

BUILD FAILED
<https://ci.phpmyadmin.net/job/website/ws/build.xml>:32: Execute failed: java.io.IOException: Cannot run program "csslint" (in directory "<https://ci.phpmyadmin.net/job/website/ws/")>: error=2, No such file or directory
        at java.lang.ProcessBuilder.start(ProcessBuilder.java:1048)
        at java.lang.Runtime.exec(Runtime.java:620)
        at org.apache.tools.ant.taskdefs.launcher.Java13CommandLauncher.exec(Java13CommandLauncher.java:58)
        at org.apache.tools.ant.taskdefs.Execute.launch(Execute.java:426)
        at org.apache.tools.ant.taskdefs.Execute.execute(Execute.java:440)
        at org.apache.tools.ant.taskdefs.ExecTask.runExecute(ExecTask.java:629)
        at org.apache.tools.ant.taskdefs.ExecTask.runExec(ExecTask.java:670)
        at org.apache.tools.ant.taskdefs.ExecTask.execute(ExecTask.java:496)
        at org.apache.tools.ant.UnknownElement.execute(UnknownElement.java:293)
        at sun.reflect.NativeMethodAccessorImpl.invoke0(Native Method)
        at sun.reflect.NativeMethodAccessorImpl.invoke(NativeMethodAccessorImpl.java:62)
        at sun.reflect.DelegatingMethodAccessorImpl.invoke(DelegatingMethodAccessorImpl.java:43)
        at java.lang.reflect.Method.invoke(Method.java:498)
        at org.apache.tools.ant.dispatch.DispatchUtils.execute(DispatchUtils.java:106)
        at org.apache.tools.ant.Task.perform(Task.java:348)
        at org.apache.tools.ant.Target.execute(Target.java:435)
        at org.apache.tools.ant.Target.performTasks(Target.java:456)
        at org.apache.tools.ant.Project.executeSortedTargets(Project.java:1405)
        at org.apache.tools.ant.Project.executeTarget(Project.java:1376)
        at org.apache.tools.ant.helper.DefaultExecutor.executeTargets(DefaultExecutor.java:41)
        at org.apache.tools.ant.Project.executeTargets(Project.java:1260)
        at org.apache.tools.ant.Main.runBuild(Main.java:857)
        at org.apache.tools.ant.Main.startAnt(Main.java:236)
        at org.apache.tools.ant.launch.Launcher.run(Launcher.java:287)
        at org.apache.tools.ant.launch.Launcher.main(Launcher.java:113)
Caused by: java.io.IOException: error=2, No such file or directory
        at java.lang.UNIXProcess.forkAndExec(Native Method)
        at java.lang.UNIXProcess.<init>(UNIXProcess.java:247)
        at java.lang.ProcessImpl.start(ProcessImpl.java:134)
        at java.lang.ProcessBuilder.start(ProcessBuilder.java:1029)
        ... 24 more

Total time: 39 seconds
Build step 'Invoke Ant' marked build as failure
[TASKS] Skipping publisher since build result is FAILURE
[htmlpublisher] Archiving HTML reports...
[htmlpublisher] Archiving at PROJECT level <https://ci.phpmyadmin.net/job/website/ws/output> to /var/lib/jenkins/jobs/website/htmlreports/Generated_website

_______________________________________________
Developers mailing list
[hidden email]
https://lists.phpmyadmin.net/mailman/listinfo/developers
Reply | Threaded
Open this post in threaded view
|

[phpMyAdmin Developers] Jenkins build is back to normal : website #614

Jenkins Daemon