[phpMyAdmin Developers] Build failed in Jenkins: phpMyAdmin-continuous #13801

classic Classic list List threaded Threaded
3 messages Options
Reply | Threaded
Open this post in threaded view
|

[phpMyAdmin Developers] Build failed in Jenkins: phpMyAdmin-continuous #13801

Jenkins Daemon
See <https://ci.phpmyadmin.net/job/phpMyAdmin-continuous/13801/display/redirect?page=changes>

Changes:

[Michal Čihař] Remove sprites from the themes

[weblate] Translated using Weblate (English (United Kingdom))

------------------------------------------
Started by GitHub push by nijel
Started by GitHub push by nijel
[EnvInject] - Loading node environment variables.
Building in workspace <https://ci.phpmyadmin.net/job/phpMyAdmin-continuous/ws/>
 > git rev-parse --is-inside-work-tree # timeout=10
Fetching changes from the remote Git repository
 > git config remote.origin.url https://github.com/phpmyadmin/phpmyadmin.git # timeout=10
Fetching upstream changes from https://github.com/phpmyadmin/phpmyadmin.git
 > git --version # timeout=10
 > git fetch --tags --progress https://github.com/phpmyadmin/phpmyadmin.git +refs/heads/*:refs/remotes/origin/*
 > git rev-parse origin/master^{commit} # timeout=10
Checking out Revision 842d35792fb43ca6e8c7da379e7e91caf0a61c22 (origin/master)
Commit message: "Merge remote-tracking branch 'origin/master'"
 > git config core.sparsecheckout # timeout=10
 > git checkout -f 842d35792fb43ca6e8c7da379e7e91caf0a61c22
 > git rev-list 912d367a3b4c400c5b956d100bac7e68652f2cfc # timeout=10
 > git tag -a -f -m Jenkins Build #13801 jenkins-phpMyAdmin-continuous-13801 # timeout=10
[EnvInject] - Executing scripts and injecting environment variables after the SCM step.
[EnvInject] - Injecting as environment variables the properties content
TESTSUITE_URL=http://ci-live.phpmyadmin.net/phpMyAdmin-continuous/workspace/
TESTSUITE_USER=pmatest
TESTSUITE_DATABASE=pmatest
XTESTSUITE_BROWSERSTACK_USER=michaliha
TESTSUITE_SERVER=localhost

[EnvInject] - Variables injected successfully.
[workspace] $ /bin/sh -xe /tmp/jenkins6066002618513551526.sh
+ composer update --no-interaction
Loading composer repositories with package information
Updating dependencies (including require-dev)
Nothing to install or update
Generating autoload files
[workspace] $ ant ******** ******** clean locales phpunit-nocoverage phpcpd phpcs phploc jshint jshint-checkstyle
Unable to locate tools.jar. Expected to find it in /usr/lib/jvm/java-8-openjdk-amd64/lib/tools.jar
Buildfile: <https://ci.phpmyadmin.net/job/phpMyAdmin-continuous/ws/build.xml>

clean:
   [delete] Deleting directory <https://ci.phpmyadmin.net/job/phpMyAdmin-continuous/ws/build/api>
   [delete] Deleting directory <https://ci.phpmyadmin.net/job/phpMyAdmin-continuous/ws/build/code-browser>
   [delete] Deleting directory <https://ci.phpmyadmin.net/job/phpMyAdmin-continuous/ws/build/coverage>
   [delete] Deleting directory <https://ci.phpmyadmin.net/job/phpMyAdmin-continuous/ws/build/logs>
   [delete] Deleting directory <https://ci.phpmyadmin.net/job/phpMyAdmin-continuous/ws/build/pdepend>
    [mkdir] Created dir: <https://ci.phpmyadmin.net/job/phpMyAdmin-continuous/ws/build/api>
    [mkdir] Created dir: <https://ci.phpmyadmin.net/job/phpMyAdmin-continuous/ws/build/code-browser>
    [mkdir] Created dir: <https://ci.phpmyadmin.net/job/phpMyAdmin-continuous/ws/build/coverage>
    [mkdir] Created dir: <https://ci.phpmyadmin.net/job/phpMyAdmin-continuous/ws/build/logs>
    [mkdir] Created dir: <https://ci.phpmyadmin.net/job/phpMyAdmin-continuous/ws/build/pdepend>

locales:
     [exec] po/en_GB.po:2664: a format specification for argument 1 doesn't exist in 'msgstr'
     [exec] msgfmt: found 1 fatal error
     [exec] tput: No value for $TERM and no -T specified
     [exec] Error when compiling po/en_GB.po
     [exec] tput: No value for $TERM and no -T specified

BUILD FAILED
<https://ci.phpmyadmin.net/job/phpMyAdmin-continuous/ws/build.xml>:140: exec returned: 1

Total time: 8 seconds
Build step 'Invoke Ant' marked build as failure
[CHECKSTYLE] Skipping publisher since build result is FAILURE
[JSLINT] Skipping publisher since build result is FAILURE
[DRY] Collecting duplicate code analysis files...
[DRY] Searching for all files in <https://ci.phpmyadmin.net/job/phpMyAdmin-continuous/ws/> that match the pattern build/logs/pmd-cpd.xml
[DRY] No files found. Configuration error?
[DRY] Computing warning deltas based on reference build #13800
[TASKS] Skipping publisher since build result is FAILURE
[ANALYSIS-COLLECTOR] Computing warning deltas based on reference build #13800
Recording plot data
[xUnit] [INFO] - Starting to record.
[xUnit] [INFO] - Processing PHPUnit-3.x (default)
[xUnit] [INFO] - [PHPUnit-3.x (default)] - No test report file(s) were found with the pattern 'build/logs/junit.xml' relative to '<https://ci.phpmyadmin.net/job/phpMyAdmin-continuous/ws/'> for the testing framework 'PHPUnit-3.x (default)'.  Did you enter a pattern relative to the correct directory?  Did you generate the result report(s) for 'PHPUnit-3.x (default)'?
[xUnit] [ERROR] - No test reports found for the metric 'PHPUnit' with the resolved pattern 'build/logs/junit.xml'. Configuration error?.
[xUnit] [INFO] - Failing BUILD.
[xUnit] [INFO] - There are errors when processing test results.
[xUnit] [INFO] - Skipping tests recording.
[xUnit] [INFO] - Stop build.

_______________________________________________
Developers mailing list
[hidden email]
https://lists.phpmyadmin.net/mailman/listinfo/developers
Reply | Threaded
Open this post in threaded view
|

[phpMyAdmin Developers] Build failed in Jenkins: phpMyAdmin-continuous #13802

Jenkins Daemon
See <https://ci.phpmyadmin.net/job/phpMyAdmin-continuous/13802/display/redirect?page=changes>

Changes:

[mauriciofauth] Make Multi Table Query strings translatable.

------------------------------------------
Started by GitHub push by mauriciofauth
[EnvInject] - Loading node environment variables.
Building in workspace <https://ci.phpmyadmin.net/job/phpMyAdmin-continuous/ws/>
 > git rev-parse --is-inside-work-tree # timeout=10
Fetching changes from the remote Git repository
 > git config remote.origin.url https://github.com/phpmyadmin/phpmyadmin.git # timeout=10
Fetching upstream changes from https://github.com/phpmyadmin/phpmyadmin.git
 > git --version # timeout=10
 > git fetch --tags --progress https://github.com/phpmyadmin/phpmyadmin.git +refs/heads/*:refs/remotes/origin/*
 > git rev-parse origin/master^{commit} # timeout=10
Checking out Revision 608242662d79d2be33e250b56f3d5f064ea9fb50 (origin/master)
Commit message: "Make Multi Table Query strings translatable."
 > git config core.sparsecheckout # timeout=10
 > git checkout -f 608242662d79d2be33e250b56f3d5f064ea9fb50
 > git rev-list 842d35792fb43ca6e8c7da379e7e91caf0a61c22 # timeout=10
 > git tag -a -f -m Jenkins Build #13802 jenkins-phpMyAdmin-continuous-13802 # timeout=10
[EnvInject] - Executing scripts and injecting environment variables after the SCM step.
[EnvInject] - Injecting as environment variables the properties content
TESTSUITE_URL=http://ci-live.phpmyadmin.net/phpMyAdmin-continuous/workspace/
TESTSUITE_USER=pmatest
TESTSUITE_DATABASE=pmatest
XTESTSUITE_BROWSERSTACK_USER=michaliha
TESTSUITE_SERVER=localhost

[EnvInject] - Variables injected successfully.
[workspace] $ /bin/sh -xe /tmp/jenkins914140487945148133.sh
+ composer update --no-interaction
Loading composer repositories with package information
Updating dependencies (including require-dev)
Nothing to install or update
Generating autoload files
[workspace] $ ant ******** ******** clean locales phpunit-nocoverage phpcpd phpcs phploc jshint jshint-checkstyle
Unable to locate tools.jar. Expected to find it in /usr/lib/jvm/java-8-openjdk-amd64/lib/tools.jar
Buildfile: <https://ci.phpmyadmin.net/job/phpMyAdmin-continuous/ws/build.xml>

clean:
   [delete] Deleting directory <https://ci.phpmyadmin.net/job/phpMyAdmin-continuous/ws/build/api>
   [delete] Deleting directory <https://ci.phpmyadmin.net/job/phpMyAdmin-continuous/ws/build/code-browser>
   [delete] Deleting directory <https://ci.phpmyadmin.net/job/phpMyAdmin-continuous/ws/build/coverage>
   [delete] Deleting directory <https://ci.phpmyadmin.net/job/phpMyAdmin-continuous/ws/build/logs>
   [delete] Deleting directory <https://ci.phpmyadmin.net/job/phpMyAdmin-continuous/ws/build/pdepend>
    [mkdir] Created dir: <https://ci.phpmyadmin.net/job/phpMyAdmin-continuous/ws/build/api>
    [mkdir] Created dir: <https://ci.phpmyadmin.net/job/phpMyAdmin-continuous/ws/build/code-browser>
    [mkdir] Created dir: <https://ci.phpmyadmin.net/job/phpMyAdmin-continuous/ws/build/coverage>
    [mkdir] Created dir: <https://ci.phpmyadmin.net/job/phpMyAdmin-continuous/ws/build/logs>
    [mkdir] Created dir: <https://ci.phpmyadmin.net/job/phpMyAdmin-continuous/ws/build/pdepend>

locales:
     [exec] po/en_GB.po:2664: a format specification for argument 1 doesn't exist in 'msgstr'
     [exec] msgfmt: found 1 fatal error
     [exec] tput: No value for $TERM and no -T specified
     [exec] Error when compiling po/en_GB.po
     [exec] tput: No value for $TERM and no -T specified

BUILD FAILED
<https://ci.phpmyadmin.net/job/phpMyAdmin-continuous/ws/build.xml>:140: exec returned: 1

Total time: 8 seconds
Build step 'Invoke Ant' marked build as failure
[CHECKSTYLE] Skipping publisher since build result is FAILURE
[JSLINT] Skipping publisher since build result is FAILURE
[DRY] Collecting duplicate code analysis files...
[DRY] Searching for all files in <https://ci.phpmyadmin.net/job/phpMyAdmin-continuous/ws/> that match the pattern build/logs/pmd-cpd.xml
[DRY] No files found. Configuration error?
[DRY] Computing warning deltas based on reference build #13800
[TASKS] Skipping publisher since build result is FAILURE
[ANALYSIS-COLLECTOR] Computing warning deltas based on reference build #13800
Recording plot data
[xUnit] [INFO] - Starting to record.
[xUnit] [INFO] - Processing PHPUnit-3.x (default)
[xUnit] [INFO] - [PHPUnit-3.x (default)] - No test report file(s) were found with the pattern 'build/logs/junit.xml' relative to '<https://ci.phpmyadmin.net/job/phpMyAdmin-continuous/ws/'> for the testing framework 'PHPUnit-3.x (default)'.  Did you enter a pattern relative to the correct directory?  Did you generate the result report(s) for 'PHPUnit-3.x (default)'?
[xUnit] [ERROR] - No test reports found for the metric 'PHPUnit' with the resolved pattern 'build/logs/junit.xml'. Configuration error?.
[xUnit] [INFO] - Failing BUILD.
[xUnit] [INFO] - There are errors when processing test results.
[xUnit] [INFO] - Skipping tests recording.
[xUnit] [INFO] - Stop build.

_______________________________________________
Developers mailing list
[hidden email]
https://lists.phpmyadmin.net/mailman/listinfo/developers
Reply | Threaded
Open this post in threaded view
|

[phpMyAdmin Developers] Jenkins build is back to normal : phpMyAdmin-continuous #13803

Jenkins Daemon