[phpMyAdmin Developers] Build failed in Jenkins: phpMyAdmin-continuous #13653

classic Classic list List threaded Threaded
3 messages Options
Reply | Threaded
Open this post in threaded view
|

[phpMyAdmin Developers] Build failed in Jenkins: phpMyAdmin-continuous #13653

Jenkins Daemon
See <https://ci.phpmyadmin.net/job/phpMyAdmin-continuous/13653/display/redirect?page=changes>

Changes:

[madhura.cj] Fix #13722 DisableIS is not fully honored

------------------------------------------
Started by GitHub push by madhuracj
[EnvInject] - Loading node environment variables.
Building in workspace <https://ci.phpmyadmin.net/job/phpMyAdmin-continuous/ws/>
 > git rev-parse --is-inside-work-tree # timeout=10
Fetching changes from the remote Git repository
 > git config remote.origin.url https://github.com/phpmyadmin/phpmyadmin.git # timeout=10
Fetching upstream changes from https://github.com/phpmyadmin/phpmyadmin.git
 > git --version # timeout=10
 > git fetch --tags --progress https://github.com/phpmyadmin/phpmyadmin.git +refs/heads/*:refs/remotes/origin/*
 > git rev-parse origin/master^{commit} # timeout=10
Checking out Revision c0cabf95b8d09aaa7e7e18f64d355689e9ab0d7a (origin/master)
Commit message: "Fix #13722 DisableIS is not fully honored"
 > git config core.sparsecheckout # timeout=10
 > git checkout -f c0cabf95b8d09aaa7e7e18f64d355689e9ab0d7a
 > git rev-list 1621e1ab8a71e15d9bc7176e2b5e153256b03f9f # timeout=10
 > git tag -a -f -m Jenkins Build #13653 jenkins-phpMyAdmin-continuous-13653 # timeout=10
[EnvInject] - Executing scripts and injecting environment variables after the SCM step.
[EnvInject] - Injecting as environment variables the properties content
TESTSUITE_URL=http://ci-live.phpmyadmin.net/phpMyAdmin-continuous/workspace/
TESTSUITE_USER=pmatest
TESTSUITE_DATABASE=pmatest
XTESTSUITE_BROWSERSTACK_USER=michaliha
TESTSUITE_SERVER=localhost

[EnvInject] - Variables injected successfully.
[workspace] $ /bin/sh -xe /tmp/jenkins6387084203868405975.sh
+ composer update --no-interaction
Loading composer repositories with package information
Updating dependencies (including require-dev)
Nothing to install or update
Generating autoload files
[workspace] $ ant ******** ******** clean locales phpunit-nocoverage phpcpd phpcs phploc jshint jshint-checkstyle
Unable to locate tools.jar. Expected to find it in /usr/lib/jvm/java-8-openjdk-amd64/lib/tools.jar
Buildfile: <https://ci.phpmyadmin.net/job/phpMyAdmin-continuous/ws/build.xml>

clean:
   [delete] Deleting directory <https://ci.phpmyadmin.net/job/phpMyAdmin-continuous/ws/build/api>
   [delete] Deleting directory <https://ci.phpmyadmin.net/job/phpMyAdmin-continuous/ws/build/code-browser>
   [delete] Deleting directory <https://ci.phpmyadmin.net/job/phpMyAdmin-continuous/ws/build/coverage>
   [delete] Deleting directory <https://ci.phpmyadmin.net/job/phpMyAdmin-continuous/ws/build/logs>
   [delete] Deleting directory <https://ci.phpmyadmin.net/job/phpMyAdmin-continuous/ws/build/pdepend>
    [mkdir] Created dir: <https://ci.phpmyadmin.net/job/phpMyAdmin-continuous/ws/build/api>
    [mkdir] Created dir: <https://ci.phpmyadmin.net/job/phpMyAdmin-continuous/ws/build/code-browser>
    [mkdir] Created dir: <https://ci.phpmyadmin.net/job/phpMyAdmin-continuous/ws/build/coverage>
    [mkdir] Created dir: <https://ci.phpmyadmin.net/job/phpMyAdmin-continuous/ws/build/logs>
    [mkdir] Created dir: <https://ci.phpmyadmin.net/job/phpMyAdmin-continuous/ws/build/pdepend>

locales:

phpunit-nocoverage:
     [exec] PHPUnit 4.8.36 by Sebastian Bergmann and contributors.
     [exec]
     [exec] Runtime: PHP 7.0.19-1
     [exec] Configuration: <https://ci.phpmyadmin.net/job/phpMyAdmin-continuous/ws/phpunit.xml.nocoverage>
     [exec] Warning: Deprecated configuration setting "strict" used
     [exec] Warning: Deprecated configuration setting "selenium" used
     [exec]
     [exec] .............................................................   61 / 2367 (  2%)
     [exec] .............................................................  122 / 2367 (  5%)
     [exec] ......................ENot supported query: SELECT `CHARACTER_SET_NAME` AS `Charset`, `DESCRIPTION` AS `Description` FROM `information_schema`.`CHARACTER_SETS`
     [exec] ENot supported query: SELECT `CHARACTER_SET_NAME` AS `Charset`, `DESCRIPTION` AS `Description` FROM `information_schema`.`CHARACTER_SETS`
     [exec] .....................................  183 / 2367 (  7%)
     [exec] .............................................................  244 / 2367 ( 10%)
     [exec] .....................R.......................................  305 / 2367 ( 12%)
     [exec] .............................................................  366 / 2367 ( 15%)
     [exec] .............................................................  427 / 2367 ( 18%)
     [exec] .....................................................SSSSSSSS  488 / 2367 ( 20%)
     [exec] I.................I..........................................  549 / 2367 ( 23%)
     [exec] .............................................................  610 / 2367 ( 25%)
     [exec] .............................................................  671 / 2367 ( 28%)
     [exec] .............................................................  732 / 2367 ( 30%)
     [exec] .............................................................  793 / 2367 ( 33%)
     [exec] .............................................................  854 / 2367 ( 36%)
     [exec] .............................................................  915 / 2367 ( 38%)
     [exec] .............................................................  976 / 2367 ( 41%)
     [exec] ............................................................. 1037 / 2367 ( 43%)
     [exec] .........................................ENot supported query: SELECT `CHARACTER_SET_NAME` AS `Charset`, `DESCRIPTION` AS `Description` FROM `information_schema`.`CHARACTER_SETS`
     [exec] ................... 1098 / 2367 ( 46%)
     [exec] ............................................................. 1159 / 2367 ( 48%)
     [exec] ............................................................. 1220 / 2367 ( 51%)
     [exec] ............................................................. 1281 / 2367 ( 54%)
     [exec] ............................................................. 1342 / 2367 ( 56%)
     [exec] ............................................................. 1403 / 2367 ( 59%)
     [exec] ............................................................. 1464 / 2367 ( 61%)
     [exec] ............................................................. 1525 / 2367 ( 64%)
     [exec] ...................................................Not supported query: SELECT `CHARACTER_SET_NAME` AS `Charset`, `DESCRIPTION` AS `Description` FROM `information_schema`.`CHARACTER_SETS`
     [exec] <div class="error"><h1>Error</h1><p><strong>SQL query:</strong>
     [exec] <a href="./url.php?url=https%3A%2F%2Fdev.mysql.com%2Fdoc%2Frefman%2F5.7%2Fen%2Fselect.html" target="mysql_doc"><img src="themes/dot.gif" title="Documentation" alt="Documentation" class="icon ic_b_help" /></a><a href="server_sql.php?sql_query=SELECT+%60CHARACTER_SET_NAME%60+AS+%60Charset%60%2C+%60DESCRIPTION%60+AS+%60Description%60+FROM+%60information_schema%60.%60CHARACTER_SETS%60&amp;show_query=1&amp;server=0&amp;lang=en"><span class="nowrap"><img src="themes/dot.gif" title="Edit" alt="Edit" class="icon ic_b_edit" />&nbsp;Edit</span></a>    </p>
     [exec] <p>
     [exec] <code class="sql"><pre>
     [exec] SELECT `CHARACTER_SET_NAME` AS `Charset`, `DESCRIPTION` AS `Description` FROM `information_schema`.`CHARACTER_SETS`
     [exec] </pre></code>
     [exec] </p>
     [exec] </div>

phpcpd:
     [exec] phpcpd 3.0.0 by Sebastian Bergmann.
     [exec]
     [exec] Found 6 clones with 400 duplicated lines in 8 files:
     [exec]
     [exec]   - <https://ci.phpmyadmin.net/job/phpMyAdmin-continuous/ws/libraries/dbi/dbi_dummy.inc.php>:295-403
     [exec]     <https://ci.phpmyadmin.net/job/phpMyAdmin-continuous/ws/libraries/dbi/dbi_dummy.inc.php>:401-509
     [exec]
     [exec]   - <https://ci.phpmyadmin.net/job/phpMyAdmin-continuous/ws/libraries/classes/Plugins/Schema/Svg/SvgRelationSchema.php>:105-155
     [exec]     <https://ci.phpmyadmin.net/job/phpMyAdmin-continuous/ws/libraries/classes/Plugins/Schema/Eps/EpsRelationSchema.php>:93-143
     [exec]
     [exec]   - <https://ci.phpmyadmin.net/job/phpMyAdmin-continuous/ws/libraries/classes/Plugins/Export/Helpers/Pdf.php>:235-276
     [exec]     <https://ci.phpmyadmin.net/job/phpMyAdmin-continuous/ws/libraries/classes/Plugins/Export/Helpers/Pdf.php>:392-433
     [exec]
     [exec]   - <https://ci.phpmyadmin.net/job/phpMyAdmin-continuous/ws/libraries/classes/Plugins/Export/Helpers/Pdf.php>:357-423
     [exec]     <https://ci.phpmyadmin.net/job/phpMyAdmin-continuous/ws/libraries/classes/Plugins/Export/Helpers/Pdf.php>:597-663
     [exec]
     [exec]   - <https://ci.phpmyadmin.net/job/phpMyAdmin-continuous/ws/libraries/classes/Plugins/Export/ExportYaml.php>:106-173
     [exec]     <https://ci.phpmyadmin.net/job/phpMyAdmin-continuous/ws/libraries/classes/Plugins/Export/ExportPhparray.php>:130-197
     [exec]
     [exec]   - <https://ci.phpmyadmin.net/job/phpMyAdmin-continuous/ws/libraries/classes/Plugins/Export/ExportOds.php>:174-242
     [exec]     <https://ci.phpmyadmin.net/job/phpMyAdmin-continuous/ws/libraries/classes/Plugins/Export/ExportOdt.php>:202-270
     [exec]
     [exec] 0.24% duplicated lines out of 163704 total lines of code.
     [exec]
     [exec] Time: 1.03 seconds, Memory: 111.00MB
     [exec] Result: 1

phpcs-config:
     [exec] Using config file: <https://ci.phpmyadmin.net/job/phpMyAdmin-continuous/ws/vendor/squizlabs/php_codesniffer/CodeSniffer.conf>
     [exec]
     [exec] Config value "installed_paths" updated successfully; old value was "<https://ci.phpmyadmin.net/job/phpMyAdmin-continuous/ws/vendor/phpmyadmin/coding-standard">

phpcs:
     [exec] Time: 18.34 secs; Memory: 44.01Mb
     [exec]
     [exec] Result: 2

phploc:
     [exec] phploc 4.0.0 by Sebastian Bergmann.
     [exec]
     [exec] Directories                                         56
     [exec] Files                                              506
     [exec]
     [exec] Size
     [exec]   Lines of Code (LOC)                           163704
     [exec]   Comment Lines of Code (CLOC)                   42700 (26.08%)
     [exec]   Non-Comment Lines of Code (NCLOC)             121004 (73.92%)
     [exec]   Logical Lines of Code (LLOC)                   35774 (21.85%)
     [exec]     Classes                                      28457 (79.55%)
     [exec]       Average Class Length                          77
     [exec]         Minimum Class Length                         0
     [exec]         Maximum Class Length                      1098
     [exec]       Average Method Length                          9
     [exec]         Minimum Method Length                        0
     [exec]         Maximum Method Length                      562
     [exec]     Functions                                      476 (1.33%)
     [exec]       Average Function Length                       12
     [exec]     Not in classes or functions                   6841 (19.12%)
     [exec]
     [exec] Cyclomatic Complexity
     [exec]   Average Complexity per LLOC                     0.37
     [exec]   Average Complexity per Class                   32.65
     [exec]     Minimum Class Complexity                      1.00
     [exec]     Maximum Class Complexity                    575.00
     [exec]   Average Complexity per Method                   4.89
     [exec]     Minimum Method Complexity                     1.00
     [exec]     Maximum Method Complexity                   562.00
     [exec]
     [exec] Dependencies
     [exec]   Global Accesses                                 7334
     [exec]     Global Constants                                82 (1.12%)
     [exec]     Global Variables                              4705 (64.15%)
     [exec]     Super-Global Variables                        2547 (34.73%)
     [exec]   Attribute Accesses                              4658
     [exec]     Non-Static                                    4529 (97.23%)
     [exec]     Static                                         129 (2.77%)
     [exec]   Method Calls                                   12400
     [exec]     Non-Static                                    7117 (57.40%)
     [exec]     Static                                        5283 (42.60%)
     [exec]
     [exec] Structure
     [exec]   Namespaces                                        44
     [exec]   Interfaces                                         4
     [exec]   Traits                                             0
     [exec]   Classes                                          361
     [exec]     Abstract Classes                                41 (11.36%)
     [exec]     Concrete Classes                               320 (88.64%)
     [exec]   Methods                                         3004
     [exec]     Scope
     [exec]       Non-Static Methods                          1825 (60.75%)
     [exec]       Static Methods                              1179 (39.25%)
     [exec]     Visibility
     [exec]       Public Methods                              2517 (83.79%)
     [exec]       Non-Public Methods                           487 (16.21%)
     [exec]   Functions                                         37
     [exec]     Named Functions                                  6 (16.22%)
     [exec]     Anonymous Functions                             31 (83.78%)
     [exec]   Constants                                        134
     [exec]     Global Constants                                46 (34.33%)
     [exec]     Class Constants                                 88 (65.67%)

jshint:
    [apply] Result: 2

jshint-checkstyle:
    [apply] Result: 2

BUILD SUCCESSFUL
Total time: 54 seconds
[CHECKSTYLE] Collecting checkstyle analysis files...
[CHECKSTYLE] Searching for all files in <https://ci.phpmyadmin.net/job/phpMyAdmin-continuous/ws/> that match the pattern build/logs/checkstyle.xml
[CHECKSTYLE] Parsing 1 file in <https://ci.phpmyadmin.net/job/phpMyAdmin-continuous/ws/>
[CHECKSTYLE] Successfully parsed file <https://ci.phpmyadmin.net/job/phpMyAdmin-continuous/ws/build/logs/checkstyle.xml> with 334 unique warnings and 0 duplicates.
[CHECKSTYLE] Computing warning deltas based on reference build #13652
[JSLINT] Collecting JSLint analysis files...
[JSLINT] Searching for all files in <https://ci.phpmyadmin.net/job/phpMyAdmin-continuous/ws/> that match the pattern build/logs/jshint-checkstyle.xml
[JSLINT] Parsing 1 file in <https://ci.phpmyadmin.net/job/phpMyAdmin-continuous/ws/>
[JSLINT] Successfully parsed file <https://ci.phpmyadmin.net/job/phpMyAdmin-continuous/ws/build/logs/jshint-checkstyle.xml> with 180 unique warnings and 0 duplicates.
[JSLINT] Computing warning deltas based on reference build #13652
[DRY] Collecting duplicate code analysis files...
[DRY] Searching for all files in <https://ci.phpmyadmin.net/job/phpMyAdmin-continuous/ws/> that match the pattern build/logs/pmd-cpd.xml
[DRY] Parsing 1 file in <https://ci.phpmyadmin.net/job/phpMyAdmin-continuous/ws/>
[DRY] Successfully parsed file <https://ci.phpmyadmin.net/job/phpMyAdmin-continuous/ws/build/logs/pmd-cpd.xml> with 12 unique warnings and 0 duplicates.
[DRY] Computing warning deltas based on reference build #13652
[TASKS] Scanning folder '<https://ci.phpmyadmin.net/job/phpMyAdmin-continuous/ws/'> for files matching the pattern '**/*.php' - excludes: build/**,vendor/**,tmp/**
[TASKS] Found 727 files to scan for tasks
[TASKS] Found 142 open tasks.
[TASKS] Computing warning deltas based on reference build #13652
[ANALYSIS-COLLECTOR] Computing warning deltas based on reference build #13652
Recording plot data
[xUnit] [INFO] - Starting to record.
[xUnit] [INFO] - Processing PHPUnit-3.x (default)
[xUnit] [INFO] - [PHPUnit-3.x (default)] - 1 test report file(s) were found with the pattern 'build/logs/junit.xml' relative to '<https://ci.phpmyadmin.net/job/phpMyAdmin-continuous/ws/'> for the testing framework 'PHPUnit-3.x (default)'.
[xUnit] [ERROR] - The result file '<https://ci.phpmyadmin.net/job/phpMyAdmin-continuous/ws/build/logs/junit.xml'> for the metric 'PHPUnit' is empty. The result file has been skipped.
[xUnit] [INFO] - Failing BUILD because 'set build failed if errors' option is activated.
[xUnit] [INFO] - There are errors when processing test results.
[xUnit] [INFO] - Skipping tests recording.
[xUnit] [INFO] - Stop build.
Build step 'Publish xUnit test result report' changed build result to FAILURE

_______________________________________________
Developers mailing list
[hidden email]
https://lists.phpmyadmin.net/mailman/listinfo/developers
Reply | Threaded
Open this post in threaded view
|

[phpMyAdmin Developers] Build failed in Jenkins: phpMyAdmin-continuous #13654

Jenkins Daemon
See <https://ci.phpmyadmin.net/job/phpMyAdmin-continuous/13654/display/redirect?page=changes>

Changes:

[madhura.cj] Update dummy dbi queries and results

------------------------------------------
[...truncated 18.15 KB...]
     [exec] <https://ci.phpmyadmin.net/job/phpMyAdmin-continuous/ws/test/selenium/PmaSeleniumExportTest.php>:28
     [exec]
     [exec] 31) PMA_SeleniumExportTest::testDbExport with data set #2 ('JSON', array('{"id":"1","val":"2"}'))
     [exec] Selenium testing not configured.
     [exec]
     [exec] <https://ci.phpmyadmin.net/job/phpMyAdmin-continuous/ws/test/selenium/TestBase.php>:174
     [exec] <https://ci.phpmyadmin.net/job/phpMyAdmin-continuous/ws/test/selenium/PmaSeleniumExportTest.php>:28
     [exec]
     [exec] 32) PMA_SeleniumExportTest::testTableExport with data set #0 ('CSV', array('"1","2"'))
     [exec] Selenium testing not configured.
     [exec]
     [exec] <https://ci.phpmyadmin.net/job/phpMyAdmin-continuous/ws/test/selenium/TestBase.php>:174
     [exec] <https://ci.phpmyadmin.net/job/phpMyAdmin-continuous/ws/test/selenium/PmaSeleniumExportTest.php>:28
     [exec]
     [exec] 33) PMA_SeleniumExportTest::testTableExport with data set #1 ('SQL', array('CREATE TABLE IF NOT EXISTS `t...table`', 'INSERT INTO `test_table` (`id...VALUES', '(1, 2)'))
     [exec] Selenium testing not configured.
     [exec]
     [exec] <https://ci.phpmyadmin.net/job/phpMyAdmin-continuous/ws/test/selenium/TestBase.php>:174
     [exec] <https://ci.phpmyadmin.net/job/phpMyAdmin-continuous/ws/test/selenium/PmaSeleniumExportTest.php>:28
     [exec]
     [exec] 34) PMA_SeleniumExportTest::testTableExport with data set #2 ('JSON', array('{"id":"1","val":"2"}'))
     [exec] Selenium testing not configured.
     [exec]
     [exec] <https://ci.phpmyadmin.net/job/phpMyAdmin-continuous/ws/test/selenium/TestBase.php>:174
     [exec] <https://ci.phpmyadmin.net/job/phpMyAdmin-continuous/ws/test/selenium/PmaSeleniumExportTest.php>:28
     [exec]
     [exec] 35) PMA_SeleniumImportTest::testServerImport
     [exec] Selenium testing not configured.
     [exec]
     [exec] <https://ci.phpmyadmin.net/job/phpMyAdmin-continuous/ws/test/selenium/TestBase.php>:174
     [exec]
     [exec] 36) PMA_SeleniumImportTest::testDbImport
     [exec] Selenium testing not configured.
     [exec]
     [exec] <https://ci.phpmyadmin.net/job/phpMyAdmin-continuous/ws/test/selenium/TestBase.php>:174
     [exec]
     [exec] 37) PMA_SeleniumImportTest::testTableImport
     [exec] Selenium testing not configured.
     [exec]
     [exec] <https://ci.phpmyadmin.net/job/phpMyAdmin-continuous/ws/test/selenium/TestBase.php>:174
     [exec]
     [exec] 38) PMA_SeleniumLoginTest::testSuccessfulLogin
     [exec] Selenium testing not configured.
     [exec]
     [exec] <https://ci.phpmyadmin.net/job/phpMyAdmin-continuous/ws/test/selenium/TestBase.php>:174
     [exec]
     [exec] 39) PMA_SeleniumLoginTest::testLoginWithWrongPassword
     [exec] Selenium testing not configured.
     [exec]
     [exec] <https://ci.phpmyadmin.net/job/phpMyAdmin-continuous/ws/test/selenium/TestBase.php>:174
     [exec]
     [exec] 40) PMA_SeleniumNormalizationTest::testNormalizationTo1NF
     [exec] Selenium testing not configured.
     [exec]
     [exec] <https://ci.phpmyadmin.net/job/phpMyAdmin-continuous/ws/test/selenium/TestBase.php>:174
     [exec] <https://ci.phpmyadmin.net/job/phpMyAdmin-continuous/ws/test/selenium/PmaSeleniumNormalizationTest.php>:28
     [exec]
     [exec] 41) PmaSeleniumQueryByExampleTest::testQueryByExample
     [exec] Broken, see https://github.com/phpmyadmin/phpmyadmin/issues/13621
     [exec]
     [exec] <https://ci.phpmyadmin.net/job/phpMyAdmin-continuous/ws/test/selenium/PmaSeleniumQueryByExampleTest.php>:29
     [exec]
     [exec] 42) PMA_SeleniumSettingsTest::testHideDatabase
     [exec] Selenium testing not configured.
     [exec]
     [exec] <https://ci.phpmyadmin.net/job/phpMyAdmin-continuous/ws/test/selenium/TestBase.php>:174
     [exec]
     [exec] 43) PMA_SeleniumSettingsTest::testSettingsTabsAreDisplayed
     [exec] Selenium testing not configured.
     [exec]
     [exec] <https://ci.phpmyadmin.net/job/phpMyAdmin-continuous/ws/test/selenium/TestBase.php>:174
     [exec]
     [exec] 44) PMA_SeleniumSettingsTest::testHideLogo
     [exec] Selenium testing not configured.
     [exec]
     [exec] <https://ci.phpmyadmin.net/job/phpMyAdmin-continuous/ws/test/selenium/TestBase.php>:174
     [exec]
     [exec] 45) PMA_SeleniumSqlQueryTest::testServerSqlQuery
     [exec] Selenium testing not configured.
     [exec]
     [exec] <https://ci.phpmyadmin.net/job/phpMyAdmin-continuous/ws/test/selenium/TestBase.php>:174
     [exec] <https://ci.phpmyadmin.net/job/phpMyAdmin-continuous/ws/test/selenium/PmaSeleniumSqlQueryTest.php>:29
     [exec]
     [exec] 46) PMA_SeleniumSqlQueryTest::testDatabaseSqlQuery
     [exec] Selenium testing not configured.
     [exec]
     [exec] <https://ci.phpmyadmin.net/job/phpMyAdmin-continuous/ws/test/selenium/TestBase.php>:174
     [exec] <https://ci.phpmyadmin.net/job/phpMyAdmin-continuous/ws/test/selenium/PmaSeleniumSqlQueryTest.php>:29
     [exec]
     [exec] 47) PMA_SeleniumSqlQueryTest::testTableSqlQuery
     [exec] Selenium testing not configured.
     [exec]
     [exec] <https://ci.phpmyadmin.net/job/phpMyAdmin-continuous/ws/test/selenium/TestBase.php>:174
     [exec] <https://ci.phpmyadmin.net/job/phpMyAdmin-continuous/ws/test/selenium/PmaSeleniumSqlQueryTest.php>:29
     [exec]
     [exec] 48) PMA_SeleniumTableBrowseTest::testSortRecords
     [exec] Selenium testing not configured.
     [exec]
     [exec] <https://ci.phpmyadmin.net/job/phpMyAdmin-continuous/ws/test/selenium/TestBase.php>:174
     [exec] <https://ci.phpmyadmin.net/job/phpMyAdmin-continuous/ws/test/selenium/PmaSeleniumTableBrowseTest.php>:28
     [exec]
     [exec] 49) PMA_SeleniumTableBrowseTest::testChangeRecords
     [exec] Selenium testing not configured.
     [exec]
     [exec] <https://ci.phpmyadmin.net/job/phpMyAdmin-continuous/ws/test/selenium/TestBase.php>:174
     [exec] <https://ci.phpmyadmin.net/job/phpMyAdmin-continuous/ws/test/selenium/PmaSeleniumTableBrowseTest.php>:28
     [exec]
     [exec] 50) PMA_SeleniumTableBrowseTest::testChangeRecordsByDoubleClick
     [exec] Selenium testing not configured.
     [exec]
     [exec] <https://ci.phpmyadmin.net/job/phpMyAdmin-continuous/ws/test/selenium/TestBase.php>:174
     [exec] <https://ci.phpmyadmin.net/job/phpMyAdmin-continuous/ws/test/selenium/PmaSeleniumTableBrowseTest.php>:28
     [exec]
     [exec] 51) PMA_SeleniumTableBrowseTest::testCopyRecords
     [exec] Selenium testing not configured.
     [exec]
     [exec] <https://ci.phpmyadmin.net/job/phpMyAdmin-continuous/ws/test/selenium/TestBase.php>:174
     [exec] <https://ci.phpmyadmin.net/job/phpMyAdmin-continuous/ws/test/selenium/PmaSeleniumTableBrowseTest.php>:28
     [exec]
     [exec] 52) PMA_SeleniumTableBrowseTest::testSearchRecords
     [exec] Selenium testing not configured.
     [exec]
     [exec] <https://ci.phpmyadmin.net/job/phpMyAdmin-continuous/ws/test/selenium/TestBase.php>:174
     [exec] <https://ci.phpmyadmin.net/job/phpMyAdmin-continuous/ws/test/selenium/PmaSeleniumTableBrowseTest.php>:28
     [exec]
     [exec] 53) PMA_SeleniumTableBrowseTest::testDeleteRecords
     [exec] Selenium testing not configured.
     [exec]
     [exec] <https://ci.phpmyadmin.net/job/phpMyAdmin-continuous/ws/test/selenium/TestBase.php>:174
     [exec] <https://ci.phpmyadmin.net/job/phpMyAdmin-continuous/ws/test/selenium/PmaSeleniumTableBrowseTest.php>:28
     [exec]
     [exec] 54) PMA_SeleniumTableCreateTest::testCreateTable
     [exec] Selenium testing not configured.
     [exec]
     [exec] <https://ci.phpmyadmin.net/job/phpMyAdmin-continuous/ws/test/selenium/TestBase.php>:174
     [exec]
     [exec] 55) PMA_SeleniumTableInsertTest::testAddData
     [exec] Selenium testing not configured.
     [exec]
     [exec] <https://ci.phpmyadmin.net/job/phpMyAdmin-continuous/ws/test/selenium/TestBase.php>:174
     [exec] <https://ci.phpmyadmin.net/job/phpMyAdmin-continuous/ws/test/selenium/PmaSeleniumTableInsertTest.php>:29
     [exec]
     [exec] 56) PMA_SeleniumTableOperationsTest::testChangeTableOrder
     [exec] Selenium testing not configured.
     [exec]
     [exec] <https://ci.phpmyadmin.net/job/phpMyAdmin-continuous/ws/test/selenium/TestBase.php>:174
     [exec] <https://ci.phpmyadmin.net/job/phpMyAdmin-continuous/ws/test/selenium/PmaSeleniumTableOperationsTest.php>:28
     [exec]
     [exec] 57) PMA_SeleniumTableOperationsTest::testMoveTable
     [exec] Selenium testing not configured.
     [exec]
     [exec] <https://ci.phpmyadmin.net/job/phpMyAdmin-continuous/ws/test/selenium/TestBase.php>:174
     [exec] <https://ci.phpmyadmin.net/job/phpMyAdmin-continuous/ws/test/selenium/PmaSeleniumTableOperationsTest.php>:28
     [exec]
     [exec] 58) PMA_SeleniumTableOperationsTest::testRenameTable
     [exec] Selenium testing not configured.
     [exec]
     [exec] <https://ci.phpmyadmin.net/job/phpMyAdmin-continuous/ws/test/selenium/TestBase.php>:174
     [exec] <https://ci.phpmyadmin.net/job/phpMyAdmin-continuous/ws/test/selenium/PmaSeleniumTableOperationsTest.php>:28
     [exec]
     [exec] 59) PMA_SeleniumTableOperationsTest::testCopyTable
     [exec] Selenium testing not configured.
     [exec]
     [exec] <https://ci.phpmyadmin.net/job/phpMyAdmin-continuous/ws/test/selenium/TestBase.php>:174
     [exec] <https://ci.phpmyadmin.net/job/phpMyAdmin-continuous/ws/test/selenium/PmaSeleniumTableOperationsTest.php>:28
     [exec]
     [exec] 60) PMA_SeleniumTableOperationsTest::testTruncateTable
     [exec] Selenium testing not configured.
     [exec]
     [exec] <https://ci.phpmyadmin.net/job/phpMyAdmin-continuous/ws/test/selenium/TestBase.php>:174
     [exec] <https://ci.phpmyadmin.net/job/phpMyAdmin-continuous/ws/test/selenium/PmaSeleniumTableOperationsTest.php>:28
     [exec]
     [exec] 61) PMA_SeleniumTableOperationsTest::testDropTable
     [exec] Selenium testing not configured.
     [exec]
     [exec] <https://ci.phpmyadmin.net/job/phpMyAdmin-continuous/ws/test/selenium/TestBase.php>:174
     [exec] <https://ci.phpmyadmin.net/job/phpMyAdmin-continuous/ws/test/selenium/PmaSeleniumTableOperationsTest.php>:28
     [exec]
     [exec] 62) PMA_SeleniumTableStructureTest::testAddColumn
     [exec] Selenium testing not configured.
     [exec]
     [exec] <https://ci.phpmyadmin.net/job/phpMyAdmin-continuous/ws/test/selenium/TestBase.php>:174
     [exec] <https://ci.phpmyadmin.net/job/phpMyAdmin-continuous/ws/test/selenium/PmaSeleniumTableStructureTest.php>:28
     [exec]
     [exec] 63) PMA_SeleniumTableStructureTest::testChangeColumn
     [exec] Selenium testing not configured.
     [exec]
     [exec] <https://ci.phpmyadmin.net/job/phpMyAdmin-continuous/ws/test/selenium/TestBase.php>:174
     [exec] <https://ci.phpmyadmin.net/job/phpMyAdmin-continuous/ws/test/selenium/PmaSeleniumTableStructureTest.php>:28
     [exec]
     [exec] 64) PMA_SeleniumTableStructureTest::testDropColumns
     [exec] Selenium testing not configured.
     [exec]
     [exec] <https://ci.phpmyadmin.net/job/phpMyAdmin-continuous/ws/test/selenium/TestBase.php>:174
     [exec] <https://ci.phpmyadmin.net/job/phpMyAdmin-continuous/ws/test/selenium/PmaSeleniumTableStructureTest.php>:28
     [exec]
     [exec] 65) PMA_SeleniumTrackingTest::testTrackingData
     [exec] Selenium testing not configured.
     [exec]
     [exec] <https://ci.phpmyadmin.net/job/phpMyAdmin-continuous/ws/test/selenium/TestBase.php>:174
     [exec] <https://ci.phpmyadmin.net/job/phpMyAdmin-continuous/ws/test/selenium/PmaSeleniumTrackingTest.php>:28
     [exec]
     [exec] 66) PMA_SeleniumTrackingTest::testDeactivateTracking
     [exec] Selenium testing not configured.
     [exec]
     [exec] <https://ci.phpmyadmin.net/job/phpMyAdmin-continuous/ws/test/selenium/TestBase.php>:174
     [exec] <https://ci.phpmyadmin.net/job/phpMyAdmin-continuous/ws/test/selenium/PmaSeleniumTrackingTest.php>:28
     [exec]
     [exec] 67) PMA_SeleniumTrackingTest::testDropTracking
     [exec] Selenium testing not configured.
     [exec]
     [exec] <https://ci.phpmyadmin.net/job/phpMyAdmin-continuous/ws/test/selenium/TestBase.php>:174
     [exec] <https://ci.phpmyadmin.net/job/phpMyAdmin-continuous/ws/test/selenium/PmaSeleniumTrackingTest.php>:28
     [exec]
     [exec] 68) PMA_SeleniumTrackingTest::testStructureSnapshot
     [exec] Selenium testing not configured.
     [exec]
     [exec] <https://ci.phpmyadmin.net/job/phpMyAdmin-continuous/ws/test/selenium/TestBase.php>:174
     [exec] <https://ci.phpmyadmin.net/job/phpMyAdmin-continuous/ws/test/selenium/PmaSeleniumTrackingTest.php>:28
     [exec]
     [exec] 69) PMA_SeleniumXSSTest::testQueryTabWithNullValue
     [exec] Selenium testing not configured.
     [exec]
     [exec] <https://ci.phpmyadmin.net/job/phpMyAdmin-continuous/ws/test/selenium/TestBase.php>:174
     [exec]
     [exec] FAILURES!
     [exec] Tests: 2367, Assertions: 7651, Failures: 1, Skipped: 69, Incomplete: 2, Risky: 1.

BUILD FAILED
<https://ci.phpmyadmin.net/job/phpMyAdmin-continuous/ws/build.xml>:33: exec returned: 1

Total time: 17 seconds
Build step 'Invoke Ant' marked build as failure
[CHECKSTYLE] Skipping publisher since build result is FAILURE
[JSLINT] Skipping publisher since build result is FAILURE
[DRY] Collecting duplicate code analysis files...
[DRY] Searching for all files in <https://ci.phpmyadmin.net/job/phpMyAdmin-continuous/ws/> that match the pattern build/logs/pmd-cpd.xml
[DRY] No files found. Configuration error?
[DRY] Computing warning deltas based on reference build #13652
[TASKS] Skipping publisher since build result is FAILURE
[ANALYSIS-COLLECTOR] Computing warning deltas based on reference build #13652
Recording plot data
[xUnit] [INFO] - Starting to record.
[xUnit] [INFO] - Processing PHPUnit-3.x (default)
[xUnit] [INFO] - [PHPUnit-3.x (default)] - 1 test report file(s) were found with the pattern 'build/logs/junit.xml' relative to '<https://ci.phpmyadmin.net/job/phpMyAdmin-continuous/ws/'> for the testing framework 'PHPUnit-3.x (default)'.
[xUnit] [INFO] - Check 'Failed Tests' threshold.
[xUnit] [INFO] - Check 'Skipped Tests' threshold.
[xUnit] [INFO] - Setting the build status to FAILURE
[xUnit] [INFO] - Stopping recording.

_______________________________________________
Developers mailing list
[hidden email]
https://lists.phpmyadmin.net/mailman/listinfo/developers
Reply | Threaded
Open this post in threaded view
|

[phpMyAdmin Developers] Jenkins build is back to normal : phpMyAdmin-continuous #13655

Jenkins Daemon