[phpMyAdmin Developers] Build failed in Jenkins: phpMyAdmin-continuous #13531

classic Classic list List threaded Threaded
16 messages Options
Reply | Threaded
Open this post in threaded view
|

[phpMyAdmin Developers] Build failed in Jenkins: phpMyAdmin-continuous #13531

Jenkins Daemon
See <https://ci.phpmyadmin.net/job/phpMyAdmin-continuous/13531/display/redirect?page=changes>

Changes:

[weblate] Translated using Weblate (Portuguese (Brazil))

------------------------------------------
Started by GitHub push by weblate
[EnvInject] - Loading node environment variables.
Building in workspace <https://ci.phpmyadmin.net/job/phpMyAdmin-continuous/ws/>
 > git rev-parse --is-inside-work-tree # timeout=10
Fetching changes from the remote Git repository
 > git config remote.origin.url https://github.com/phpmyadmin/phpmyadmin.git # timeout=10
Fetching upstream changes from https://github.com/phpmyadmin/phpmyadmin.git
 > git --version # timeout=10
 > git fetch --tags --progress https://github.com/phpmyadmin/phpmyadmin.git +refs/heads/*:refs/remotes/origin/*
 > git rev-parse origin/master^{commit} # timeout=10
Checking out Revision 69676e6e0a95e0e1ebbca5a3db457e0a0c8bd377 (origin/master)
Commit message: "Translated using Weblate (Portuguese (Brazil))"
 > git config core.sparsecheckout # timeout=10
 > git checkout -f 69676e6e0a95e0e1ebbca5a3db457e0a0c8bd377
 > git rev-list 71fc98bbab7cf048e4f0f11ab65e89e6a49ab46b # timeout=10
 > git tag -a -f -m Jenkins Build #13531 jenkins-phpMyAdmin-continuous-13531 # timeout=10
[EnvInject] - Executing scripts and injecting environment variables after the SCM step.
[EnvInject] - Injecting as environment variables the properties content
TESTSUITE_URL=http://ci-live.phpmyadmin.net/phpMyAdmin-continuous/workspace/
TESTSUITE_USER=pmatest
TESTSUITE_DATABASE=pmatest
XTESTSUITE_BROWSERSTACK_USER=michaliha
TESTSUITE_SERVER=localhost

[EnvInject] - Variables injected successfully.
[workspace] $ /bin/sh -xe /tmp/jenkins8732516700438204085.sh
+ composer update --no-interaction
Loading composer repositories with package information
Updating dependencies (including require-dev)
Nothing to install or update
Generating autoload files
[workspace] $ ant ******** ******** clean locales phpunit-nocoverage phpcpd phpcs phploc jshint jshint-checkstyle
Unable to locate tools.jar. Expected to find it in /usr/lib/jvm/java-8-openjdk-amd64/lib/tools.jar
Buildfile: <https://ci.phpmyadmin.net/job/phpMyAdmin-continuous/ws/build.xml>

clean:
   [delete] Deleting directory <https://ci.phpmyadmin.net/job/phpMyAdmin-continuous/ws/build/api>
   [delete] Deleting directory <https://ci.phpmyadmin.net/job/phpMyAdmin-continuous/ws/build/code-browser>
   [delete] Deleting directory <https://ci.phpmyadmin.net/job/phpMyAdmin-continuous/ws/build/coverage>
   [delete] Deleting directory <https://ci.phpmyadmin.net/job/phpMyAdmin-continuous/ws/build/logs>
   [delete] Deleting directory <https://ci.phpmyadmin.net/job/phpMyAdmin-continuous/ws/build/pdepend>
    [mkdir] Created dir: <https://ci.phpmyadmin.net/job/phpMyAdmin-continuous/ws/build/api>
    [mkdir] Created dir: <https://ci.phpmyadmin.net/job/phpMyAdmin-continuous/ws/build/code-browser>
    [mkdir] Created dir: <https://ci.phpmyadmin.net/job/phpMyAdmin-continuous/ws/build/coverage>
    [mkdir] Created dir: <https://ci.phpmyadmin.net/job/phpMyAdmin-continuous/ws/build/logs>
    [mkdir] Created dir: <https://ci.phpmyadmin.net/job/phpMyAdmin-continuous/ws/build/pdepend>

locales:
     [exec] po/pt_BR.po:6745: a format specification for argument 1 doesn't exist in 'msgstr'
     [exec] msgfmt: found 1 fatal error
     [exec] tput: No value for $TERM and no -T specified
     [exec] Error when compiling po/pt_BR.po
     [exec] tput: No value for $TERM and no -T specified

BUILD FAILED
<https://ci.phpmyadmin.net/job/phpMyAdmin-continuous/ws/build.xml>:140: exec returned: 1

Total time: 23 seconds
Build step 'Invoke Ant' marked build as failure
[CHECKSTYLE] Skipping publisher since build result is FAILURE
[JSLINT] Skipping publisher since build result is FAILURE
[DRY] Collecting duplicate code analysis files...
[DRY] Searching for all files in <https://ci.phpmyadmin.net/job/phpMyAdmin-continuous/ws/> that match the pattern build/logs/pmd-cpd.xml
[DRY] No files found. Configuration error?
[DRY] Computing warning deltas based on reference build #13530
[TASKS] Skipping publisher since build result is FAILURE
[ANALYSIS-COLLECTOR] Computing warning deltas based on reference build #13530
Recording plot data
[xUnit] [INFO] - Starting to record.
[xUnit] [INFO] - Processing PHPUnit-3.x (default)
[xUnit] [INFO] - [PHPUnit-3.x (default)] - No test report file(s) were found with the pattern 'build/logs/junit.xml' relative to '<https://ci.phpmyadmin.net/job/phpMyAdmin-continuous/ws/'> for the testing framework 'PHPUnit-3.x (default)'.  Did you enter a pattern relative to the correct directory?  Did you generate the result report(s) for 'PHPUnit-3.x (default)'?
[xUnit] [ERROR] - No test reports found for the metric 'PHPUnit' with the resolved pattern 'build/logs/junit.xml'. Configuration error?.
[xUnit] [INFO] - Failing BUILD.
[xUnit] [INFO] - There are errors when processing test results.
[xUnit] [INFO] - Skipping tests recording.
[xUnit] [INFO] - Stop build.

_______________________________________________
Developers mailing list
[hidden email]
https://lists.phpmyadmin.net/mailman/listinfo/developers
Reply | Threaded
Open this post in threaded view
|

[phpMyAdmin Developers] Build failed in Jenkins: phpMyAdmin-continuous #13532

Jenkins Daemon
See <https://ci.phpmyadmin.net/job/phpMyAdmin-continuous/13532/display/redirect>

------------------------------------------
Started by GitHub push by weblate
[EnvInject] - Loading node environment variables.
Building in workspace <https://ci.phpmyadmin.net/job/phpMyAdmin-continuous/ws/>
 > git rev-parse --is-inside-work-tree # timeout=10
Fetching changes from the remote Git repository
 > git config remote.origin.url https://github.com/phpmyadmin/phpmyadmin.git # timeout=10
Fetching upstream changes from https://github.com/phpmyadmin/phpmyadmin.git
 > git --version # timeout=10
 > git fetch --tags --progress https://github.com/phpmyadmin/phpmyadmin.git +refs/heads/*:refs/remotes/origin/*
 > git rev-parse origin/master^{commit} # timeout=10
Checking out Revision 69676e6e0a95e0e1ebbca5a3db457e0a0c8bd377 (origin/master)
Commit message: "Translated using Weblate (Portuguese (Brazil))"
 > git config core.sparsecheckout # timeout=10
 > git checkout -f 69676e6e0a95e0e1ebbca5a3db457e0a0c8bd377
 > git rev-list 69676e6e0a95e0e1ebbca5a3db457e0a0c8bd377 # timeout=10
 > git tag -a -f -m Jenkins Build #13532 jenkins-phpMyAdmin-continuous-13532 # timeout=10
[EnvInject] - Executing scripts and injecting environment variables after the SCM step.
[EnvInject] - Injecting as environment variables the properties content
TESTSUITE_URL=http://ci-live.phpmyadmin.net/phpMyAdmin-continuous/workspace/
TESTSUITE_USER=pmatest
TESTSUITE_DATABASE=pmatest
XTESTSUITE_BROWSERSTACK_USER=michaliha
TESTSUITE_SERVER=localhost

[EnvInject] - Variables injected successfully.
[workspace] $ /bin/sh -xe /tmp/jenkins6733447628500523374.sh
+ composer update --no-interaction
Loading composer repositories with package information
Updating dependencies (including require-dev)
Nothing to install or update
Generating autoload files
[workspace] $ ant ******** ******** clean locales phpunit-nocoverage phpcpd phpcs phploc jshint jshint-checkstyle
Unable to locate tools.jar. Expected to find it in /usr/lib/jvm/java-8-openjdk-amd64/lib/tools.jar
Buildfile: <https://ci.phpmyadmin.net/job/phpMyAdmin-continuous/ws/build.xml>

clean:
   [delete] Deleting directory <https://ci.phpmyadmin.net/job/phpMyAdmin-continuous/ws/build/api>
   [delete] Deleting directory <https://ci.phpmyadmin.net/job/phpMyAdmin-continuous/ws/build/code-browser>
   [delete] Deleting directory <https://ci.phpmyadmin.net/job/phpMyAdmin-continuous/ws/build/coverage>
   [delete] Deleting directory <https://ci.phpmyadmin.net/job/phpMyAdmin-continuous/ws/build/logs>
   [delete] Deleting directory <https://ci.phpmyadmin.net/job/phpMyAdmin-continuous/ws/build/pdepend>
    [mkdir] Created dir: <https://ci.phpmyadmin.net/job/phpMyAdmin-continuous/ws/build/api>
    [mkdir] Created dir: <https://ci.phpmyadmin.net/job/phpMyAdmin-continuous/ws/build/code-browser>
    [mkdir] Created dir: <https://ci.phpmyadmin.net/job/phpMyAdmin-continuous/ws/build/coverage>
    [mkdir] Created dir: <https://ci.phpmyadmin.net/job/phpMyAdmin-continuous/ws/build/logs>
    [mkdir] Created dir: <https://ci.phpmyadmin.net/job/phpMyAdmin-continuous/ws/build/pdepend>

locales:
     [exec] po/pt_BR.po:6745: a format specification for argument 1 doesn't exist in 'msgstr'
     [exec] msgfmt: found 1 fatal error
     [exec] tput: No value for $TERM and no -T specified
     [exec] Error when compiling po/pt_BR.po
     [exec] tput: No value for $TERM and no -T specified

BUILD FAILED
<https://ci.phpmyadmin.net/job/phpMyAdmin-continuous/ws/build.xml>:140: exec returned: 1

Total time: 12 seconds
Build step 'Invoke Ant' marked build as failure
[CHECKSTYLE] Skipping publisher since build result is FAILURE
[JSLINT] Skipping publisher since build result is FAILURE
[DRY] Collecting duplicate code analysis files...
[DRY] Searching for all files in <https://ci.phpmyadmin.net/job/phpMyAdmin-continuous/ws/> that match the pattern build/logs/pmd-cpd.xml
[DRY] No files found. Configuration error?
[DRY] Computing warning deltas based on reference build #13530
[TASKS] Skipping publisher since build result is FAILURE
[ANALYSIS-COLLECTOR] Computing warning deltas based on reference build #13530
Recording plot data
[xUnit] [INFO] - Starting to record.
[xUnit] [INFO] - Processing PHPUnit-3.x (default)
[xUnit] [INFO] - [PHPUnit-3.x (default)] - No test report file(s) were found with the pattern 'build/logs/junit.xml' relative to '<https://ci.phpmyadmin.net/job/phpMyAdmin-continuous/ws/'> for the testing framework 'PHPUnit-3.x (default)'.  Did you enter a pattern relative to the correct directory?  Did you generate the result report(s) for 'PHPUnit-3.x (default)'?
[xUnit] [ERROR] - No test reports found for the metric 'PHPUnit' with the resolved pattern 'build/logs/junit.xml'. Configuration error?.
[xUnit] [INFO] - Failing BUILD.
[xUnit] [INFO] - There are errors when processing test results.
[xUnit] [INFO] - Skipping tests recording.
[xUnit] [INFO] - Stop build.

_______________________________________________
Developers mailing list
[hidden email]
https://lists.phpmyadmin.net/mailman/listinfo/developers
Reply | Threaded
Open this post in threaded view
|

[phpMyAdmin Developers] Build failed in Jenkins: phpMyAdmin-continuous #13533

Jenkins Daemon
See <https://ci.phpmyadmin.net/job/phpMyAdmin-continuous/13533/display/redirect?page=changes>

Changes:

[weblate] Translated using Weblate (Spanish)

------------------------------------------
Started by GitHub push by weblate
Started by GitHub push by weblate
[EnvInject] - Loading node environment variables.
Building in workspace <https://ci.phpmyadmin.net/job/phpMyAdmin-continuous/ws/>
 > git rev-parse --is-inside-work-tree # timeout=10
Fetching changes from the remote Git repository
 > git config remote.origin.url https://github.com/phpmyadmin/phpmyadmin.git # timeout=10
Fetching upstream changes from https://github.com/phpmyadmin/phpmyadmin.git
 > git --version # timeout=10
 > git fetch --tags --progress https://github.com/phpmyadmin/phpmyadmin.git +refs/heads/*:refs/remotes/origin/*
 > git rev-parse origin/master^{commit} # timeout=10
Checking out Revision df7e4159580abf10fadb3a9d5b93a0824c819257 (origin/master)
Commit message: "Translated using Weblate (Spanish)"
 > git config core.sparsecheckout # timeout=10
 > git checkout -f df7e4159580abf10fadb3a9d5b93a0824c819257
 > git rev-list 69676e6e0a95e0e1ebbca5a3db457e0a0c8bd377 # timeout=10
 > git tag -a -f -m Jenkins Build #13533 jenkins-phpMyAdmin-continuous-13533 # timeout=10
[EnvInject] - Executing scripts and injecting environment variables after the SCM step.
[EnvInject] - Injecting as environment variables the properties content
TESTSUITE_URL=http://ci-live.phpmyadmin.net/phpMyAdmin-continuous/workspace/
TESTSUITE_USER=pmatest
TESTSUITE_DATABASE=pmatest
XTESTSUITE_BROWSERSTACK_USER=michaliha
TESTSUITE_SERVER=localhost

[EnvInject] - Variables injected successfully.
[workspace] $ /bin/sh -xe /tmp/jenkins9090704453038738434.sh
+ composer update --no-interaction
Loading composer repositories with package information
Updating dependencies (including require-dev)
Nothing to install or update
Generating autoload files
[workspace] $ ant ******** ******** clean locales phpunit-nocoverage phpcpd phpcs phploc jshint jshint-checkstyle
Unable to locate tools.jar. Expected to find it in /usr/lib/jvm/java-8-openjdk-amd64/lib/tools.jar
Buildfile: <https://ci.phpmyadmin.net/job/phpMyAdmin-continuous/ws/build.xml>

clean:
   [delete] Deleting directory <https://ci.phpmyadmin.net/job/phpMyAdmin-continuous/ws/build/api>
   [delete] Deleting directory <https://ci.phpmyadmin.net/job/phpMyAdmin-continuous/ws/build/code-browser>
   [delete] Deleting directory <https://ci.phpmyadmin.net/job/phpMyAdmin-continuous/ws/build/coverage>
   [delete] Deleting directory <https://ci.phpmyadmin.net/job/phpMyAdmin-continuous/ws/build/logs>
   [delete] Deleting directory <https://ci.phpmyadmin.net/job/phpMyAdmin-continuous/ws/build/pdepend>
    [mkdir] Created dir: <https://ci.phpmyadmin.net/job/phpMyAdmin-continuous/ws/build/api>
    [mkdir] Created dir: <https://ci.phpmyadmin.net/job/phpMyAdmin-continuous/ws/build/code-browser>
    [mkdir] Created dir: <https://ci.phpmyadmin.net/job/phpMyAdmin-continuous/ws/build/coverage>
    [mkdir] Created dir: <https://ci.phpmyadmin.net/job/phpMyAdmin-continuous/ws/build/logs>
    [mkdir] Created dir: <https://ci.phpmyadmin.net/job/phpMyAdmin-continuous/ws/build/pdepend>

locales:
     [exec] po/pt_BR.po:6745: a format specification for argument 1 doesn't exist in 'msgstr'
     [exec] msgfmt: found 1 fatal error
     [exec] tput: No value for $TERM and no -T specified
     [exec] Error when compiling po/pt_BR.po
     [exec] tput: No value for $TERM and no -T specified

BUILD FAILED
<https://ci.phpmyadmin.net/job/phpMyAdmin-continuous/ws/build.xml>:140: exec returned: 1

Total time: 11 seconds
Build step 'Invoke Ant' marked build as failure
[CHECKSTYLE] Skipping publisher since build result is FAILURE
[JSLINT] Skipping publisher since build result is FAILURE
[DRY] Collecting duplicate code analysis files...
[DRY] Searching for all files in <https://ci.phpmyadmin.net/job/phpMyAdmin-continuous/ws/> that match the pattern build/logs/pmd-cpd.xml
[DRY] No files found. Configuration error?
[DRY] Computing warning deltas based on reference build #13530
[TASKS] Skipping publisher since build result is FAILURE
[ANALYSIS-COLLECTOR] Computing warning deltas based on reference build #13530
Recording plot data
[xUnit] [INFO] - Starting to record.
[xUnit] [INFO] - Processing PHPUnit-3.x (default)
[xUnit] [INFO] - [PHPUnit-3.x (default)] - No test report file(s) were found with the pattern 'build/logs/junit.xml' relative to '<https://ci.phpmyadmin.net/job/phpMyAdmin-continuous/ws/'> for the testing framework 'PHPUnit-3.x (default)'.  Did you enter a pattern relative to the correct directory?  Did you generate the result report(s) for 'PHPUnit-3.x (default)'?
[xUnit] [ERROR] - No test reports found for the metric 'PHPUnit' with the resolved pattern 'build/logs/junit.xml'. Configuration error?.
[xUnit] [INFO] - Failing BUILD.
[xUnit] [INFO] - There are errors when processing test results.
[xUnit] [INFO] - Skipping tests recording.
[xUnit] [INFO] - Stop build.

_______________________________________________
Developers mailing list
[hidden email]
https://lists.phpmyadmin.net/mailman/listinfo/developers
Reply | Threaded
Open this post in threaded view
|

[phpMyAdmin Developers] Build failed in Jenkins: phpMyAdmin-continuous #13534

Jenkins Daemon
See <https://ci.phpmyadmin.net/job/phpMyAdmin-continuous/13534/display/redirect?page=changes>

Changes:

[weblate] Translated using Weblate (Indonesian)

------------------------------------------
Started by GitHub push by weblate
[EnvInject] - Loading node environment variables.
Building in workspace <https://ci.phpmyadmin.net/job/phpMyAdmin-continuous/ws/>
 > git rev-parse --is-inside-work-tree # timeout=10
Fetching changes from the remote Git repository
 > git config remote.origin.url https://github.com/phpmyadmin/phpmyadmin.git # timeout=10
Fetching upstream changes from https://github.com/phpmyadmin/phpmyadmin.git
 > git --version # timeout=10
 > git fetch --tags --progress https://github.com/phpmyadmin/phpmyadmin.git +refs/heads/*:refs/remotes/origin/*
 > git rev-parse origin/master^{commit} # timeout=10
Checking out Revision 2920cdf00fe82e046853019bf0c23acae5a9798a (origin/master)
Commit message: "Translated using Weblate (Indonesian)"
 > git config core.sparsecheckout # timeout=10
 > git checkout -f 2920cdf00fe82e046853019bf0c23acae5a9798a
 > git rev-list df7e4159580abf10fadb3a9d5b93a0824c819257 # timeout=10
 > git tag -a -f -m Jenkins Build #13534 jenkins-phpMyAdmin-continuous-13534 # timeout=10
[EnvInject] - Executing scripts and injecting environment variables after the SCM step.
[EnvInject] - Injecting as environment variables the properties content
TESTSUITE_URL=http://ci-live.phpmyadmin.net/phpMyAdmin-continuous/workspace/
TESTSUITE_USER=pmatest
TESTSUITE_DATABASE=pmatest
XTESTSUITE_BROWSERSTACK_USER=michaliha
TESTSUITE_SERVER=localhost

[EnvInject] - Variables injected successfully.
[workspace] $ /bin/sh -xe /tmp/jenkins3280606977302014125.sh
+ composer update --no-interaction
Loading composer repositories with package information
Updating dependencies (including require-dev)
Nothing to install or update
Generating autoload files
[workspace] $ ant ******** ******** clean locales phpunit-nocoverage phpcpd phpcs phploc jshint jshint-checkstyle
Unable to locate tools.jar. Expected to find it in /usr/lib/jvm/java-8-openjdk-amd64/lib/tools.jar
Buildfile: <https://ci.phpmyadmin.net/job/phpMyAdmin-continuous/ws/build.xml>

clean:
   [delete] Deleting directory <https://ci.phpmyadmin.net/job/phpMyAdmin-continuous/ws/build/api>
   [delete] Deleting directory <https://ci.phpmyadmin.net/job/phpMyAdmin-continuous/ws/build/code-browser>
   [delete] Deleting directory <https://ci.phpmyadmin.net/job/phpMyAdmin-continuous/ws/build/coverage>
   [delete] Deleting directory <https://ci.phpmyadmin.net/job/phpMyAdmin-continuous/ws/build/logs>
   [delete] Deleting directory <https://ci.phpmyadmin.net/job/phpMyAdmin-continuous/ws/build/pdepend>
    [mkdir] Created dir: <https://ci.phpmyadmin.net/job/phpMyAdmin-continuous/ws/build/api>
    [mkdir] Created dir: <https://ci.phpmyadmin.net/job/phpMyAdmin-continuous/ws/build/code-browser>
    [mkdir] Created dir: <https://ci.phpmyadmin.net/job/phpMyAdmin-continuous/ws/build/coverage>
    [mkdir] Created dir: <https://ci.phpmyadmin.net/job/phpMyAdmin-continuous/ws/build/logs>
    [mkdir] Created dir: <https://ci.phpmyadmin.net/job/phpMyAdmin-continuous/ws/build/pdepend>

locales:
     [exec] po/pt_BR.po:6745: a format specification for argument 1 doesn't exist in 'msgstr'
     [exec] msgfmt: found 1 fatal error
     [exec] tput: No value for $TERM and no -T specified
     [exec] Error when compiling po/pt_BR.po
     [exec] tput: No value for $TERM and no -T specified

BUILD FAILED
<https://ci.phpmyadmin.net/job/phpMyAdmin-continuous/ws/build.xml>:140: exec returned: 1

Total time: 11 seconds
Build step 'Invoke Ant' marked build as failure
[CHECKSTYLE] Skipping publisher since build result is FAILURE
[JSLINT] Skipping publisher since build result is FAILURE
[DRY] Collecting duplicate code analysis files...
[DRY] Searching for all files in <https://ci.phpmyadmin.net/job/phpMyAdmin-continuous/ws/> that match the pattern build/logs/pmd-cpd.xml
[DRY] No files found. Configuration error?
[DRY] Computing warning deltas based on reference build #13530
[TASKS] Skipping publisher since build result is FAILURE
[ANALYSIS-COLLECTOR] Computing warning deltas based on reference build #13530
Recording plot data
[xUnit] [INFO] - Starting to record.
[xUnit] [INFO] - Processing PHPUnit-3.x (default)
[xUnit] [INFO] - [PHPUnit-3.x (default)] - No test report file(s) were found with the pattern 'build/logs/junit.xml' relative to '<https://ci.phpmyadmin.net/job/phpMyAdmin-continuous/ws/'> for the testing framework 'PHPUnit-3.x (default)'.  Did you enter a pattern relative to the correct directory?  Did you generate the result report(s) for 'PHPUnit-3.x (default)'?
[xUnit] [ERROR] - No test reports found for the metric 'PHPUnit' with the resolved pattern 'build/logs/junit.xml'. Configuration error?.
[xUnit] [INFO] - Failing BUILD.
[xUnit] [INFO] - There are errors when processing test results.
[xUnit] [INFO] - Skipping tests recording.
[xUnit] [INFO] - Stop build.

_______________________________________________
Developers mailing list
[hidden email]
https://lists.phpmyadmin.net/mailman/listinfo/developers
Reply | Threaded
Open this post in threaded view
|

[phpMyAdmin Developers] Build failed in Jenkins: phpMyAdmin-continuous #13535

Jenkins Daemon
See <https://ci.phpmyadmin.net/job/phpMyAdmin-continuous/13535/display/redirect>

------------------------------------------
Started by GitHub push by weblate
[EnvInject] - Loading node environment variables.
Building in workspace <https://ci.phpmyadmin.net/job/phpMyAdmin-continuous/ws/>
 > git rev-parse --is-inside-work-tree # timeout=10
Fetching changes from the remote Git repository
 > git config remote.origin.url https://github.com/phpmyadmin/phpmyadmin.git # timeout=10
Fetching upstream changes from https://github.com/phpmyadmin/phpmyadmin.git
 > git --version # timeout=10
 > git fetch --tags --progress https://github.com/phpmyadmin/phpmyadmin.git +refs/heads/*:refs/remotes/origin/*
 > git rev-parse origin/master^{commit} # timeout=10
Checking out Revision 2920cdf00fe82e046853019bf0c23acae5a9798a (origin/master)
Commit message: "Translated using Weblate (Indonesian)"
 > git config core.sparsecheckout # timeout=10
 > git checkout -f 2920cdf00fe82e046853019bf0c23acae5a9798a
 > git rev-list 2920cdf00fe82e046853019bf0c23acae5a9798a # timeout=10
 > git tag -a -f -m Jenkins Build #13535 jenkins-phpMyAdmin-continuous-13535 # timeout=10
[EnvInject] - Executing scripts and injecting environment variables after the SCM step.
[EnvInject] - Injecting as environment variables the properties content
TESTSUITE_URL=http://ci-live.phpmyadmin.net/phpMyAdmin-continuous/workspace/
TESTSUITE_USER=pmatest
TESTSUITE_DATABASE=pmatest
XTESTSUITE_BROWSERSTACK_USER=michaliha
TESTSUITE_SERVER=localhost

[EnvInject] - Variables injected successfully.
[workspace] $ /bin/sh -xe /tmp/jenkins6303451401199134025.sh
+ composer update --no-interaction
Loading composer repositories with package information
Updating dependencies (including require-dev)
Nothing to install or update
Generating autoload files
[workspace] $ ant ******** ******** clean locales phpunit-nocoverage phpcpd phpcs phploc jshint jshint-checkstyle
Unable to locate tools.jar. Expected to find it in /usr/lib/jvm/java-8-openjdk-amd64/lib/tools.jar
Buildfile: <https://ci.phpmyadmin.net/job/phpMyAdmin-continuous/ws/build.xml>

clean:
   [delete] Deleting directory <https://ci.phpmyadmin.net/job/phpMyAdmin-continuous/ws/build/api>
   [delete] Deleting directory <https://ci.phpmyadmin.net/job/phpMyAdmin-continuous/ws/build/code-browser>
   [delete] Deleting directory <https://ci.phpmyadmin.net/job/phpMyAdmin-continuous/ws/build/coverage>
   [delete] Deleting directory <https://ci.phpmyadmin.net/job/phpMyAdmin-continuous/ws/build/logs>
   [delete] Deleting directory <https://ci.phpmyadmin.net/job/phpMyAdmin-continuous/ws/build/pdepend>
    [mkdir] Created dir: <https://ci.phpmyadmin.net/job/phpMyAdmin-continuous/ws/build/api>
    [mkdir] Created dir: <https://ci.phpmyadmin.net/job/phpMyAdmin-continuous/ws/build/code-browser>
    [mkdir] Created dir: <https://ci.phpmyadmin.net/job/phpMyAdmin-continuous/ws/build/coverage>
    [mkdir] Created dir: <https://ci.phpmyadmin.net/job/phpMyAdmin-continuous/ws/build/logs>
    [mkdir] Created dir: <https://ci.phpmyadmin.net/job/phpMyAdmin-continuous/ws/build/pdepend>

locales:
     [exec] po/pt_BR.po:6745: a format specification for argument 1 doesn't exist in 'msgstr'
     [exec] msgfmt: found 1 fatal error
     [exec] tput: No value for $TERM and no -T specified
     [exec] Error when compiling po/pt_BR.po
     [exec] tput: No value for $TERM and no -T specified

BUILD FAILED
<https://ci.phpmyadmin.net/job/phpMyAdmin-continuous/ws/build.xml>:140: exec returned: 1

Total time: 11 seconds
Build step 'Invoke Ant' marked build as failure
[CHECKSTYLE] Skipping publisher since build result is FAILURE
[JSLINT] Skipping publisher since build result is FAILURE
[DRY] Collecting duplicate code analysis files...
[DRY] Searching for all files in <https://ci.phpmyadmin.net/job/phpMyAdmin-continuous/ws/> that match the pattern build/logs/pmd-cpd.xml
[DRY] No files found. Configuration error?
[DRY] Computing warning deltas based on reference build #13530
[TASKS] Skipping publisher since build result is FAILURE
[ANALYSIS-COLLECTOR] Computing warning deltas based on reference build #13530
Recording plot data
[xUnit] [INFO] - Starting to record.
[xUnit] [INFO] - Processing PHPUnit-3.x (default)
[xUnit] [INFO] - [PHPUnit-3.x (default)] - No test report file(s) were found with the pattern 'build/logs/junit.xml' relative to '<https://ci.phpmyadmin.net/job/phpMyAdmin-continuous/ws/'> for the testing framework 'PHPUnit-3.x (default)'.  Did you enter a pattern relative to the correct directory?  Did you generate the result report(s) for 'PHPUnit-3.x (default)'?
[xUnit] [ERROR] - No test reports found for the metric 'PHPUnit' with the resolved pattern 'build/logs/junit.xml'. Configuration error?.
[xUnit] [INFO] - Failing BUILD.
[xUnit] [INFO] - There are errors when processing test results.
[xUnit] [INFO] - Skipping tests recording.
[xUnit] [INFO] - Stop build.

_______________________________________________
Developers mailing list
[hidden email]
https://lists.phpmyadmin.net/mailman/listinfo/developers
Reply | Threaded
Open this post in threaded view
|

[phpMyAdmin Developers] Build failed in Jenkins: phpMyAdmin-continuous #13536

Jenkins Daemon
See <https://ci.phpmyadmin.net/job/phpMyAdmin-continuous/13536/display/redirect?page=changes>

Changes:

[weblate] Translated using Weblate (Indonesian)

------------------------------------------
Started by GitHub push by weblate
[EnvInject] - Loading node environment variables.
Building in workspace <https://ci.phpmyadmin.net/job/phpMyAdmin-continuous/ws/>
 > git rev-parse --is-inside-work-tree # timeout=10
Fetching changes from the remote Git repository
 > git config remote.origin.url https://github.com/phpmyadmin/phpmyadmin.git # timeout=10
Fetching upstream changes from https://github.com/phpmyadmin/phpmyadmin.git
 > git --version # timeout=10
 > git fetch --tags --progress https://github.com/phpmyadmin/phpmyadmin.git +refs/heads/*:refs/remotes/origin/*
 > git rev-parse origin/master^{commit} # timeout=10
Checking out Revision 89466be3217431cbf0dda454d6cb430a315caa6d (origin/master)
Commit message: "Translated using Weblate (Indonesian)"
 > git config core.sparsecheckout # timeout=10
 > git checkout -f 89466be3217431cbf0dda454d6cb430a315caa6d
 > git rev-list 2920cdf00fe82e046853019bf0c23acae5a9798a # timeout=10
 > git tag -a -f -m Jenkins Build #13536 jenkins-phpMyAdmin-continuous-13536 # timeout=10
[EnvInject] - Executing scripts and injecting environment variables after the SCM step.
[EnvInject] - Injecting as environment variables the properties content
TESTSUITE_URL=http://ci-live.phpmyadmin.net/phpMyAdmin-continuous/workspace/
TESTSUITE_USER=pmatest
TESTSUITE_DATABASE=pmatest
XTESTSUITE_BROWSERSTACK_USER=michaliha
TESTSUITE_SERVER=localhost

[EnvInject] - Variables injected successfully.
[workspace] $ /bin/sh -xe /tmp/jenkins1155336871694402244.sh
+ composer update --no-interaction
Loading composer repositories with package information
Updating dependencies (including require-dev)
Package operations: 1 install, 6 updates, 0 removals
  - Installing symfony/polyfill-apcu (v1.5.0): Downloading (connecting...)Downloading (0%)           Downloading (100%)
  - Updating symfony/cache (v3.3.8 => v3.3.9): Downloading (connecting...)Downloading (0%)           Downloading (5%)Downloading (10%)Downloading (15%)Downloading (20%)Downloading (40%)Downloading (45%)Downloading (50%)Downloading (55%)Downloading (60%)Downloading (65%)Downloading (70%)Downloading (75%)Downloading (95%)Downloading (100%)
  - Updating symfony/expression-language (v3.3.8 => v3.3.9): Downloading (connecting...)Downloading (0%)           Downloading (15%)Downloading (20%)Downloading (35%)Downloading (50%)Downloading (70%)Downloading (85%)Downloading (100%)
  - Updating symfony/debug (v3.3.8 => v3.3.9): Downloading (connecting...)Downloading (0%)           Downloading (10%)Downloading (25%)Downloading (30%)Downloading (40%)Downloading (45%)Downloading (55%)Downloading (65%)Downloading (75%)Downloading (80%)Downloading (90%)Downloading (100%)
  - Updating symfony/console (v3.3.8 => v3.3.9): Downloading (connecting...)Downloading (0%)           Downloading (5%)Downloading (10%)Downloading (15%)Downloading (20%)Downloading (25%)Downloading (30%)Downloading (35%)Downloading (40%)Downloading (45%)Downloading (50%)Downloading (55%)Downloading (60%)Downloading (65%)Downloading (70%)Downloading (75%)Downloading (80%)Downloading (85%)Downloading (90%)Downloading (95%)Downloading (100%)
  - Updating symfony/yaml (v3.3.8 => v3.3.9): Loading from cache
  - Updating symfony/process (v3.3.8 => v3.3.9): Loading from cache
Writing lock file
Generating autoload files
[workspace] $ ant ******** ******** clean locales phpunit-nocoverage phpcpd phpcs phploc jshint jshint-checkstyle
Unable to locate tools.jar. Expected to find it in /usr/lib/jvm/java-8-openjdk-amd64/lib/tools.jar
Buildfile: <https://ci.phpmyadmin.net/job/phpMyAdmin-continuous/ws/build.xml>

clean:
   [delete] Deleting directory <https://ci.phpmyadmin.net/job/phpMyAdmin-continuous/ws/build/api>
   [delete] Deleting directory <https://ci.phpmyadmin.net/job/phpMyAdmin-continuous/ws/build/code-browser>
   [delete] Deleting directory <https://ci.phpmyadmin.net/job/phpMyAdmin-continuous/ws/build/coverage>
   [delete] Deleting directory <https://ci.phpmyadmin.net/job/phpMyAdmin-continuous/ws/build/logs>
   [delete] Deleting directory <https://ci.phpmyadmin.net/job/phpMyAdmin-continuous/ws/build/pdepend>
    [mkdir] Created dir: <https://ci.phpmyadmin.net/job/phpMyAdmin-continuous/ws/build/api>
    [mkdir] Created dir: <https://ci.phpmyadmin.net/job/phpMyAdmin-continuous/ws/build/code-browser>
    [mkdir] Created dir: <https://ci.phpmyadmin.net/job/phpMyAdmin-continuous/ws/build/coverage>
    [mkdir] Created dir: <https://ci.phpmyadmin.net/job/phpMyAdmin-continuous/ws/build/logs>
    [mkdir] Created dir: <https://ci.phpmyadmin.net/job/phpMyAdmin-continuous/ws/build/pdepend>

locales:
     [exec] po/pt_BR.po:6745: a format specification for argument 1 doesn't exist in 'msgstr'
     [exec] msgfmt: found 1 fatal error
     [exec] tput: No value for $TERM and no -T specified
     [exec] Error when compiling po/pt_BR.po
     [exec] tput: No value for $TERM and no -T specified

BUILD FAILED
<https://ci.phpmyadmin.net/job/phpMyAdmin-continuous/ws/build.xml>:140: exec returned: 1

Total time: 11 seconds
Build step 'Invoke Ant' marked build as failure
[CHECKSTYLE] Skipping publisher since build result is FAILURE
[JSLINT] Skipping publisher since build result is FAILURE
[DRY] Collecting duplicate code analysis files...
[DRY] Searching for all files in <https://ci.phpmyadmin.net/job/phpMyAdmin-continuous/ws/> that match the pattern build/logs/pmd-cpd.xml
[DRY] No files found. Configuration error?
[DRY] Computing warning deltas based on reference build #13530
[TASKS] Skipping publisher since build result is FAILURE
[ANALYSIS-COLLECTOR] Computing warning deltas based on reference build #13530
Recording plot data
[xUnit] [INFO] - Starting to record.
[xUnit] [INFO] - Processing PHPUnit-3.x (default)
[xUnit] [INFO] - [PHPUnit-3.x (default)] - No test report file(s) were found with the pattern 'build/logs/junit.xml' relative to '<https://ci.phpmyadmin.net/job/phpMyAdmin-continuous/ws/'> for the testing framework 'PHPUnit-3.x (default)'.  Did you enter a pattern relative to the correct directory?  Did you generate the result report(s) for 'PHPUnit-3.x (default)'?
[xUnit] [ERROR] - No test reports found for the metric 'PHPUnit' with the resolved pattern 'build/logs/junit.xml'. Configuration error?.
[xUnit] [INFO] - Failing BUILD.
[xUnit] [INFO] - There are errors when processing test results.
[xUnit] [INFO] - Skipping tests recording.
[xUnit] [INFO] - Stop build.

_______________________________________________
Developers mailing list
[hidden email]
https://lists.phpmyadmin.net/mailman/listinfo/developers
Reply | Threaded
Open this post in threaded view
|

[phpMyAdmin Developers] Build failed in Jenkins: phpMyAdmin-continuous #13537

Jenkins Daemon
See <https://ci.phpmyadmin.net/job/phpMyAdmin-continuous/13537/display/redirect>

------------------------------------------
Started by GitHub push by weblate
[EnvInject] - Loading node environment variables.
Building in workspace <https://ci.phpmyadmin.net/job/phpMyAdmin-continuous/ws/>
 > git rev-parse --is-inside-work-tree # timeout=10
Fetching changes from the remote Git repository
 > git config remote.origin.url https://github.com/phpmyadmin/phpmyadmin.git # timeout=10
Fetching upstream changes from https://github.com/phpmyadmin/phpmyadmin.git
 > git --version # timeout=10
 > git fetch --tags --progress https://github.com/phpmyadmin/phpmyadmin.git +refs/heads/*:refs/remotes/origin/*
 > git rev-parse origin/master^{commit} # timeout=10
Checking out Revision 89466be3217431cbf0dda454d6cb430a315caa6d (origin/master)
Commit message: "Translated using Weblate (Indonesian)"
 > git config core.sparsecheckout # timeout=10
 > git checkout -f 89466be3217431cbf0dda454d6cb430a315caa6d
 > git rev-list 89466be3217431cbf0dda454d6cb430a315caa6d # timeout=10
 > git tag -a -f -m Jenkins Build #13537 jenkins-phpMyAdmin-continuous-13537 # timeout=10
[EnvInject] - Executing scripts and injecting environment variables after the SCM step.
[EnvInject] - Injecting as environment variables the properties content
TESTSUITE_URL=http://ci-live.phpmyadmin.net/phpMyAdmin-continuous/workspace/
TESTSUITE_USER=pmatest
TESTSUITE_DATABASE=pmatest
XTESTSUITE_BROWSERSTACK_USER=michaliha
TESTSUITE_SERVER=localhost

[EnvInject] - Variables injected successfully.
[workspace] $ /bin/sh -xe /tmp/jenkins2036868822508990694.sh
+ composer update --no-interaction
Loading composer repositories with package information
Updating dependencies (including require-dev)
Nothing to install or update
Generating autoload files
[workspace] $ ant ******** ******** clean locales phpunit-nocoverage phpcpd phpcs phploc jshint jshint-checkstyle
Unable to locate tools.jar. Expected to find it in /usr/lib/jvm/java-8-openjdk-amd64/lib/tools.jar
Buildfile: <https://ci.phpmyadmin.net/job/phpMyAdmin-continuous/ws/build.xml>

clean:
   [delete] Deleting directory <https://ci.phpmyadmin.net/job/phpMyAdmin-continuous/ws/build/api>
   [delete] Deleting directory <https://ci.phpmyadmin.net/job/phpMyAdmin-continuous/ws/build/code-browser>
   [delete] Deleting directory <https://ci.phpmyadmin.net/job/phpMyAdmin-continuous/ws/build/coverage>
   [delete] Deleting directory <https://ci.phpmyadmin.net/job/phpMyAdmin-continuous/ws/build/logs>
   [delete] Deleting directory <https://ci.phpmyadmin.net/job/phpMyAdmin-continuous/ws/build/pdepend>
    [mkdir] Created dir: <https://ci.phpmyadmin.net/job/phpMyAdmin-continuous/ws/build/api>
    [mkdir] Created dir: <https://ci.phpmyadmin.net/job/phpMyAdmin-continuous/ws/build/code-browser>
    [mkdir] Created dir: <https://ci.phpmyadmin.net/job/phpMyAdmin-continuous/ws/build/coverage>
    [mkdir] Created dir: <https://ci.phpmyadmin.net/job/phpMyAdmin-continuous/ws/build/logs>
    [mkdir] Created dir: <https://ci.phpmyadmin.net/job/phpMyAdmin-continuous/ws/build/pdepend>

locales:
     [exec] po/pt_BR.po:6745: a format specification for argument 1 doesn't exist in 'msgstr'
     [exec] msgfmt: found 1 fatal error
     [exec] tput: No value for $TERM and no -T specified
     [exec] Error when compiling po/pt_BR.po
     [exec] tput: No value for $TERM and no -T specified

BUILD FAILED
<https://ci.phpmyadmin.net/job/phpMyAdmin-continuous/ws/build.xml>:140: exec returned: 1

Total time: 11 seconds
Build step 'Invoke Ant' marked build as failure
[CHECKSTYLE] Skipping publisher since build result is FAILURE
[JSLINT] Skipping publisher since build result is FAILURE
[DRY] Collecting duplicate code analysis files...
[DRY] Searching for all files in <https://ci.phpmyadmin.net/job/phpMyAdmin-continuous/ws/> that match the pattern build/logs/pmd-cpd.xml
[DRY] No files found. Configuration error?
[DRY] Computing warning deltas based on reference build #13530
[TASKS] Skipping publisher since build result is FAILURE
[ANALYSIS-COLLECTOR] Computing warning deltas based on reference build #13530
Recording plot data
[xUnit] [INFO] - Starting to record.
[xUnit] [INFO] - Processing PHPUnit-3.x (default)
[xUnit] [INFO] - [PHPUnit-3.x (default)] - No test report file(s) were found with the pattern 'build/logs/junit.xml' relative to '<https://ci.phpmyadmin.net/job/phpMyAdmin-continuous/ws/'> for the testing framework 'PHPUnit-3.x (default)'.  Did you enter a pattern relative to the correct directory?  Did you generate the result report(s) for 'PHPUnit-3.x (default)'?
[xUnit] [ERROR] - No test reports found for the metric 'PHPUnit' with the resolved pattern 'build/logs/junit.xml'. Configuration error?.
[xUnit] [INFO] - Failing BUILD.
[xUnit] [INFO] - There are errors when processing test results.
[xUnit] [INFO] - Skipping tests recording.
[xUnit] [INFO] - Stop build.

_______________________________________________
Developers mailing list
[hidden email]
https://lists.phpmyadmin.net/mailman/listinfo/developers
Reply | Threaded
Open this post in threaded view
|

[phpMyAdmin Developers] Build failed in Jenkins: phpMyAdmin-continuous #13538

Jenkins Daemon
See <https://ci.phpmyadmin.net/job/phpMyAdmin-continuous/13538/display/redirect?page=changes>

Changes:

[weblate] Translated using Weblate (Indonesian)

------------------------------------------
Started by GitHub push by weblate
[EnvInject] - Loading node environment variables.
Building in workspace <https://ci.phpmyadmin.net/job/phpMyAdmin-continuous/ws/>
 > git rev-parse --is-inside-work-tree # timeout=10
Fetching changes from the remote Git repository
 > git config remote.origin.url https://github.com/phpmyadmin/phpmyadmin.git # timeout=10
Fetching upstream changes from https://github.com/phpmyadmin/phpmyadmin.git
 > git --version # timeout=10
 > git fetch --tags --progress https://github.com/phpmyadmin/phpmyadmin.git +refs/heads/*:refs/remotes/origin/*
 > git rev-parse origin/master^{commit} # timeout=10
Checking out Revision b834ac725cc4f0d05845b319b8ad95fdf49e66bf (origin/master)
Commit message: "Translated using Weblate (Indonesian)"
 > git config core.sparsecheckout # timeout=10
 > git checkout -f b834ac725cc4f0d05845b319b8ad95fdf49e66bf
 > git rev-list 89466be3217431cbf0dda454d6cb430a315caa6d # timeout=10
 > git tag -a -f -m Jenkins Build #13538 jenkins-phpMyAdmin-continuous-13538 # timeout=10
[EnvInject] - Executing scripts and injecting environment variables after the SCM step.
[EnvInject] - Injecting as environment variables the properties content
TESTSUITE_URL=http://ci-live.phpmyadmin.net/phpMyAdmin-continuous/workspace/
TESTSUITE_USER=pmatest
TESTSUITE_DATABASE=pmatest
XTESTSUITE_BROWSERSTACK_USER=michaliha
TESTSUITE_SERVER=localhost

[EnvInject] - Variables injected successfully.
[workspace] $ /bin/sh -xe /tmp/jenkins1602759552290828025.sh
+ composer update --no-interaction
Loading composer repositories with package information
Updating dependencies (including require-dev)
Nothing to install or update
Generating autoload files
[workspace] $ ant ******** ******** clean locales phpunit-nocoverage phpcpd phpcs phploc jshint jshint-checkstyle
Unable to locate tools.jar. Expected to find it in /usr/lib/jvm/java-8-openjdk-amd64/lib/tools.jar
Buildfile: <https://ci.phpmyadmin.net/job/phpMyAdmin-continuous/ws/build.xml>

clean:
   [delete] Deleting directory <https://ci.phpmyadmin.net/job/phpMyAdmin-continuous/ws/build/api>
   [delete] Deleting directory <https://ci.phpmyadmin.net/job/phpMyAdmin-continuous/ws/build/code-browser>
   [delete] Deleting directory <https://ci.phpmyadmin.net/job/phpMyAdmin-continuous/ws/build/coverage>
   [delete] Deleting directory <https://ci.phpmyadmin.net/job/phpMyAdmin-continuous/ws/build/logs>
   [delete] Deleting directory <https://ci.phpmyadmin.net/job/phpMyAdmin-continuous/ws/build/pdepend>
    [mkdir] Created dir: <https://ci.phpmyadmin.net/job/phpMyAdmin-continuous/ws/build/api>
    [mkdir] Created dir: <https://ci.phpmyadmin.net/job/phpMyAdmin-continuous/ws/build/code-browser>
    [mkdir] Created dir: <https://ci.phpmyadmin.net/job/phpMyAdmin-continuous/ws/build/coverage>
    [mkdir] Created dir: <https://ci.phpmyadmin.net/job/phpMyAdmin-continuous/ws/build/logs>
    [mkdir] Created dir: <https://ci.phpmyadmin.net/job/phpMyAdmin-continuous/ws/build/pdepend>

locales:
     [exec] po/pt_BR.po:6745: a format specification for argument 1 doesn't exist in 'msgstr'
     [exec] msgfmt: found 1 fatal error
     [exec] tput: No value for $TERM and no -T specified
     [exec] Error when compiling po/pt_BR.po
     [exec] tput: No value for $TERM and no -T specified

BUILD FAILED
<https://ci.phpmyadmin.net/job/phpMyAdmin-continuous/ws/build.xml>:140: exec returned: 1

Total time: 13 seconds
Build step 'Invoke Ant' marked build as failure
[CHECKSTYLE] Skipping publisher since build result is FAILURE
[JSLINT] Skipping publisher since build result is FAILURE
[DRY] Collecting duplicate code analysis files...
[DRY] Searching for all files in <https://ci.phpmyadmin.net/job/phpMyAdmin-continuous/ws/> that match the pattern build/logs/pmd-cpd.xml
[DRY] No files found. Configuration error?
[DRY] Computing warning deltas based on reference build #13530
[TASKS] Skipping publisher since build result is FAILURE
[ANALYSIS-COLLECTOR] Computing warning deltas based on reference build #13530
Recording plot data
[xUnit] [INFO] - Starting to record.
[xUnit] [INFO] - Processing PHPUnit-3.x (default)
[xUnit] [INFO] - [PHPUnit-3.x (default)] - No test report file(s) were found with the pattern 'build/logs/junit.xml' relative to '<https://ci.phpmyadmin.net/job/phpMyAdmin-continuous/ws/'> for the testing framework 'PHPUnit-3.x (default)'.  Did you enter a pattern relative to the correct directory?  Did you generate the result report(s) for 'PHPUnit-3.x (default)'?
[xUnit] [ERROR] - No test reports found for the metric 'PHPUnit' with the resolved pattern 'build/logs/junit.xml'. Configuration error?.
[xUnit] [INFO] - Failing BUILD.
[xUnit] [INFO] - There are errors when processing test results.
[xUnit] [INFO] - Skipping tests recording.
[xUnit] [INFO] - Stop build.

_______________________________________________
Developers mailing list
[hidden email]
https://lists.phpmyadmin.net/mailman/listinfo/developers
Reply | Threaded
Open this post in threaded view
|

[phpMyAdmin Developers] Build failed in Jenkins: phpMyAdmin-continuous #13539

Jenkins Daemon
See <https://ci.phpmyadmin.net/job/phpMyAdmin-continuous/13539/display/redirect?page=changes>

Changes:

[weblate] Translated using Weblate (Estonian)

[weblate] Translated using Weblate (Indonesian)

[weblate] Translated using Weblate (Indonesian)

[weblate] Translated using Weblate (Indonesian)

[weblate] Translated using Weblate (Spanish)

[weblate] Translated using Weblate (Indonesian)

[weblate] Translated using Weblate (Indonesian)

[weblate] Translated using Weblate (Indonesian)

[weblate] Translated using Weblate (Portuguese (Brazil))

[weblate] Translated using Weblate (Spanish)

[weblate] Translated using Weblate (Indonesian)

[weblate] Translated using Weblate (Indonesian)

[weblate] Translated using Weblate (Indonesian)

[mauriciofauth] Fix selecting multiple rows accidentally selects the next row too

------------------------------------------
Started by GitHub push by mauriciofauth
[EnvInject] - Loading node environment variables.
Building in workspace <https://ci.phpmyadmin.net/job/phpMyAdmin-continuous/ws/>
 > git rev-parse --is-inside-work-tree # timeout=10
Fetching changes from the remote Git repository
 > git config remote.origin.url https://github.com/phpmyadmin/phpmyadmin.git # timeout=10
Fetching upstream changes from https://github.com/phpmyadmin/phpmyadmin.git
 > git --version # timeout=10
 > git fetch --tags --progress https://github.com/phpmyadmin/phpmyadmin.git +refs/heads/*:refs/remotes/origin/*
 > git rev-parse origin/master^{commit} # timeout=10
Checking out Revision a893e62143d26832c5c220522c2c03189a0e4ecc (origin/master)
Commit message: "Merge branch 'QA_4_7'"
 > git config core.sparsecheckout # timeout=10
 > git checkout -f a893e62143d26832c5c220522c2c03189a0e4ecc
 > git rev-list b834ac725cc4f0d05845b319b8ad95fdf49e66bf # timeout=10
 > git tag -a -f -m Jenkins Build #13539 jenkins-phpMyAdmin-continuous-13539 # timeout=10
[EnvInject] - Executing scripts and injecting environment variables after the SCM step.
[EnvInject] - Injecting as environment variables the properties content
TESTSUITE_URL=http://ci-live.phpmyadmin.net/phpMyAdmin-continuous/workspace/
TESTSUITE_USER=pmatest
TESTSUITE_DATABASE=pmatest
XTESTSUITE_BROWSERSTACK_USER=michaliha
TESTSUITE_SERVER=localhost

[EnvInject] - Variables injected successfully.
[workspace] $ /bin/sh -xe /tmp/jenkins5244916148049524654.sh
+ composer update --no-interaction
Loading composer repositories with package information
Updating dependencies (including require-dev)
Package operations: 0 installs, 1 update, 0 removals
  - Updating phpdocumentor/reflection-common (1.0 => 1.0.1): Loading from cache
Writing lock file
Generating autoload files
[workspace] $ ant ******** ******** clean locales phpunit-nocoverage phpcpd phpcs phploc jshint jshint-checkstyle
Unable to locate tools.jar. Expected to find it in /usr/lib/jvm/java-8-openjdk-amd64/lib/tools.jar
Buildfile: <https://ci.phpmyadmin.net/job/phpMyAdmin-continuous/ws/build.xml>

clean:
   [delete] Deleting directory <https://ci.phpmyadmin.net/job/phpMyAdmin-continuous/ws/build/api>
   [delete] Deleting directory <https://ci.phpmyadmin.net/job/phpMyAdmin-continuous/ws/build/code-browser>
   [delete] Deleting directory <https://ci.phpmyadmin.net/job/phpMyAdmin-continuous/ws/build/coverage>
   [delete] Deleting directory <https://ci.phpmyadmin.net/job/phpMyAdmin-continuous/ws/build/logs>
   [delete] Deleting directory <https://ci.phpmyadmin.net/job/phpMyAdmin-continuous/ws/build/pdepend>
    [mkdir] Created dir: <https://ci.phpmyadmin.net/job/phpMyAdmin-continuous/ws/build/api>
    [mkdir] Created dir: <https://ci.phpmyadmin.net/job/phpMyAdmin-continuous/ws/build/code-browser>
    [mkdir] Created dir: <https://ci.phpmyadmin.net/job/phpMyAdmin-continuous/ws/build/coverage>
    [mkdir] Created dir: <https://ci.phpmyadmin.net/job/phpMyAdmin-continuous/ws/build/logs>
    [mkdir] Created dir: <https://ci.phpmyadmin.net/job/phpMyAdmin-continuous/ws/build/pdepend>

locales:
     [exec] po/pt_BR.po:6745: a format specification for argument 1 doesn't exist in 'msgstr'
     [exec] msgfmt: found 1 fatal error
     [exec] tput: No value for $TERM and no -T specified
     [exec] Error when compiling po/pt_BR.po
     [exec] tput: No value for $TERM and no -T specified

BUILD FAILED
<https://ci.phpmyadmin.net/job/phpMyAdmin-continuous/ws/build.xml>:140: exec returned: 1

Total time: 13 seconds
Build step 'Invoke Ant' marked build as failure
[CHECKSTYLE] Skipping publisher since build result is FAILURE
[JSLINT] Skipping publisher since build result is FAILURE
[DRY] Collecting duplicate code analysis files...
[DRY] Searching for all files in <https://ci.phpmyadmin.net/job/phpMyAdmin-continuous/ws/> that match the pattern build/logs/pmd-cpd.xml
[DRY] No files found. Configuration error?
[DRY] Computing warning deltas based on reference build #13530
[TASKS] Skipping publisher since build result is FAILURE
[ANALYSIS-COLLECTOR] Computing warning deltas based on reference build #13530
Recording plot data
[xUnit] [INFO] - Starting to record.
[xUnit] [INFO] - Processing PHPUnit-3.x (default)
[xUnit] [INFO] - [PHPUnit-3.x (default)] - No test report file(s) were found with the pattern 'build/logs/junit.xml' relative to '<https://ci.phpmyadmin.net/job/phpMyAdmin-continuous/ws/'> for the testing framework 'PHPUnit-3.x (default)'.  Did you enter a pattern relative to the correct directory?  Did you generate the result report(s) for 'PHPUnit-3.x (default)'?
[xUnit] [ERROR] - No test reports found for the metric 'PHPUnit' with the resolved pattern 'build/logs/junit.xml'. Configuration error?.
[xUnit] [INFO] - Failing BUILD.
[xUnit] [INFO] - There are errors when processing test results.
[xUnit] [INFO] - Skipping tests recording.
[xUnit] [INFO] - Stop build.

_______________________________________________
Developers mailing list
[hidden email]
https://lists.phpmyadmin.net/mailman/listinfo/developers
Reply | Threaded
Open this post in threaded view
|

[phpMyAdmin Developers] Build failed in Jenkins: phpMyAdmin-continuous #13540

Jenkins Daemon
See <https://ci.phpmyadmin.net/job/phpMyAdmin-continuous/13540/display/redirect?page=changes>

Changes:

[weblate] Translated using Weblate (Belarusian)

[weblate] Translated using Weblate (Finnish)

[weblate] Translated using Weblate (Indonesian)

------------------------------------------
Started by GitHub push by weblate
[EnvInject] - Loading node environment variables.
Building in workspace <https://ci.phpmyadmin.net/job/phpMyAdmin-continuous/ws/>
 > git rev-parse --is-inside-work-tree # timeout=10
Fetching changes from the remote Git repository
 > git config remote.origin.url https://github.com/phpmyadmin/phpmyadmin.git # timeout=10
Fetching upstream changes from https://github.com/phpmyadmin/phpmyadmin.git
 > git --version # timeout=10
 > git fetch --tags --progress https://github.com/phpmyadmin/phpmyadmin.git +refs/heads/*:refs/remotes/origin/*
 > git rev-parse origin/master^{commit} # timeout=10
Checking out Revision 9f6fcf04b4d7bae72b4899aaca743a2162d778f6 (origin/master)
Commit message: "Merge remote-tracking branch 'origin/master'"
 > git config core.sparsecheckout # timeout=10
 > git checkout -f 9f6fcf04b4d7bae72b4899aaca743a2162d778f6
 > git rev-list a893e62143d26832c5c220522c2c03189a0e4ecc # timeout=10
 > git tag -a -f -m Jenkins Build #13540 jenkins-phpMyAdmin-continuous-13540 # timeout=10
[EnvInject] - Executing scripts and injecting environment variables after the SCM step.
[EnvInject] - Injecting as environment variables the properties content
TESTSUITE_URL=http://ci-live.phpmyadmin.net/phpMyAdmin-continuous/workspace/
TESTSUITE_USER=pmatest
TESTSUITE_DATABASE=pmatest
XTESTSUITE_BROWSERSTACK_USER=michaliha
TESTSUITE_SERVER=localhost

[EnvInject] - Variables injected successfully.
[workspace] $ /bin/sh -xe /tmp/jenkins3430613368893584192.sh
+ composer update --no-interaction
Loading composer repositories with package information
Updating dependencies (including require-dev)
Nothing to install or update
Generating autoload files
[workspace] $ ant ******** ******** clean locales phpunit-nocoverage phpcpd phpcs phploc jshint jshint-checkstyle
Unable to locate tools.jar. Expected to find it in /usr/lib/jvm/java-8-openjdk-amd64/lib/tools.jar
Buildfile: <https://ci.phpmyadmin.net/job/phpMyAdmin-continuous/ws/build.xml>

clean:
   [delete] Deleting directory <https://ci.phpmyadmin.net/job/phpMyAdmin-continuous/ws/build/api>
   [delete] Deleting directory <https://ci.phpmyadmin.net/job/phpMyAdmin-continuous/ws/build/code-browser>
   [delete] Deleting directory <https://ci.phpmyadmin.net/job/phpMyAdmin-continuous/ws/build/coverage>
   [delete] Deleting directory <https://ci.phpmyadmin.net/job/phpMyAdmin-continuous/ws/build/logs>
   [delete] Deleting directory <https://ci.phpmyadmin.net/job/phpMyAdmin-continuous/ws/build/pdepend>
    [mkdir] Created dir: <https://ci.phpmyadmin.net/job/phpMyAdmin-continuous/ws/build/api>
    [mkdir] Created dir: <https://ci.phpmyadmin.net/job/phpMyAdmin-continuous/ws/build/code-browser>
    [mkdir] Created dir: <https://ci.phpmyadmin.net/job/phpMyAdmin-continuous/ws/build/coverage>
    [mkdir] Created dir: <https://ci.phpmyadmin.net/job/phpMyAdmin-continuous/ws/build/logs>
    [mkdir] Created dir: <https://ci.phpmyadmin.net/job/phpMyAdmin-continuous/ws/build/pdepend>

locales:
     [exec] po/pt_BR.po:6745: a format specification for argument 1 doesn't exist in 'msgstr'
     [exec] msgfmt: found 1 fatal error
     [exec] tput: No value for $TERM and no -T specified
     [exec] Error when compiling po/pt_BR.po
     [exec] tput: No value for $TERM and no -T specified

BUILD FAILED
<https://ci.phpmyadmin.net/job/phpMyAdmin-continuous/ws/build.xml>:140: exec returned: 1

Total time: 16 seconds
Build step 'Invoke Ant' marked build as failure
[CHECKSTYLE] Skipping publisher since build result is FAILURE
[JSLINT] Skipping publisher since build result is FAILURE
[DRY] Collecting duplicate code analysis files...
[DRY] Searching for all files in <https://ci.phpmyadmin.net/job/phpMyAdmin-continuous/ws/> that match the pattern build/logs/pmd-cpd.xml
[DRY] No files found. Configuration error?
[DRY] Computing warning deltas based on reference build #13530
[TASKS] Skipping publisher since build result is FAILURE
[ANALYSIS-COLLECTOR] Computing warning deltas based on reference build #13530
Recording plot data
[xUnit] [INFO] - Starting to record.
[xUnit] [INFO] - Processing PHPUnit-3.x (default)
[xUnit] [INFO] - [PHPUnit-3.x (default)] - No test report file(s) were found with the pattern 'build/logs/junit.xml' relative to '<https://ci.phpmyadmin.net/job/phpMyAdmin-continuous/ws/'> for the testing framework 'PHPUnit-3.x (default)'.  Did you enter a pattern relative to the correct directory?  Did you generate the result report(s) for 'PHPUnit-3.x (default)'?
[xUnit] [ERROR] - No test reports found for the metric 'PHPUnit' with the resolved pattern 'build/logs/junit.xml'. Configuration error?.
[xUnit] [INFO] - Failing BUILD.
[xUnit] [INFO] - There are errors when processing test results.
[xUnit] [INFO] - Skipping tests recording.
[xUnit] [INFO] - Stop build.

_______________________________________________
Developers mailing list
[hidden email]
https://lists.phpmyadmin.net/mailman/listinfo/developers
Reply | Threaded
Open this post in threaded view
|

[phpMyAdmin Developers] Build failed in Jenkins: phpMyAdmin-continuous #13541

Jenkins Daemon
See <https://ci.phpmyadmin.net/job/phpMyAdmin-continuous/13541/display/redirect?page=changes>

Changes:

[weblate] Translated using Weblate (Indonesian)

------------------------------------------
Started by GitHub push by weblate
Started by GitHub push by weblate
[EnvInject] - Loading node environment variables.
Building in workspace <https://ci.phpmyadmin.net/job/phpMyAdmin-continuous/ws/>
 > git rev-parse --is-inside-work-tree # timeout=10
Fetching changes from the remote Git repository
 > git config remote.origin.url https://github.com/phpmyadmin/phpmyadmin.git # timeout=10
Fetching upstream changes from https://github.com/phpmyadmin/phpmyadmin.git
 > git --version # timeout=10
 > git fetch --tags --progress https://github.com/phpmyadmin/phpmyadmin.git +refs/heads/*:refs/remotes/origin/*
 > git rev-parse origin/master^{commit} # timeout=10
Checking out Revision 71410dfac7f6d41b10561adc9008ef2058e8f9f9 (origin/master)
Commit message: "Translated using Weblate (Indonesian)"
 > git config core.sparsecheckout # timeout=10
 > git checkout -f 71410dfac7f6d41b10561adc9008ef2058e8f9f9
 > git rev-list 9f6fcf04b4d7bae72b4899aaca743a2162d778f6 # timeout=10
 > git tag -a -f -m Jenkins Build #13541 jenkins-phpMyAdmin-continuous-13541 # timeout=10
[EnvInject] - Executing scripts and injecting environment variables after the SCM step.
[EnvInject] - Injecting as environment variables the properties content
TESTSUITE_URL=http://ci-live.phpmyadmin.net/phpMyAdmin-continuous/workspace/
TESTSUITE_USER=pmatest
TESTSUITE_DATABASE=pmatest
XTESTSUITE_BROWSERSTACK_USER=michaliha
TESTSUITE_SERVER=localhost

[EnvInject] - Variables injected successfully.
[workspace] $ /bin/sh -xe /tmp/jenkins6890154930426650537.sh
+ composer update --no-interaction
Loading composer repositories with package information
Updating dependencies (including require-dev)
Nothing to install or update
Generating autoload files
[workspace] $ ant ******** ******** clean locales phpunit-nocoverage phpcpd phpcs phploc jshint jshint-checkstyle
Unable to locate tools.jar. Expected to find it in /usr/lib/jvm/java-8-openjdk-amd64/lib/tools.jar
Buildfile: <https://ci.phpmyadmin.net/job/phpMyAdmin-continuous/ws/build.xml>

clean:
   [delete] Deleting directory <https://ci.phpmyadmin.net/job/phpMyAdmin-continuous/ws/build/api>
   [delete] Deleting directory <https://ci.phpmyadmin.net/job/phpMyAdmin-continuous/ws/build/code-browser>
   [delete] Deleting directory <https://ci.phpmyadmin.net/job/phpMyAdmin-continuous/ws/build/coverage>
   [delete] Deleting directory <https://ci.phpmyadmin.net/job/phpMyAdmin-continuous/ws/build/logs>
   [delete] Deleting directory <https://ci.phpmyadmin.net/job/phpMyAdmin-continuous/ws/build/pdepend>
    [mkdir] Created dir: <https://ci.phpmyadmin.net/job/phpMyAdmin-continuous/ws/build/api>
    [mkdir] Created dir: <https://ci.phpmyadmin.net/job/phpMyAdmin-continuous/ws/build/code-browser>
    [mkdir] Created dir: <https://ci.phpmyadmin.net/job/phpMyAdmin-continuous/ws/build/coverage>
    [mkdir] Created dir: <https://ci.phpmyadmin.net/job/phpMyAdmin-continuous/ws/build/logs>
    [mkdir] Created dir: <https://ci.phpmyadmin.net/job/phpMyAdmin-continuous/ws/build/pdepend>

locales:
     [exec] po/pt_BR.po:6745: a format specification for argument 1 doesn't exist in 'msgstr'
     [exec] msgfmt: found 1 fatal error
     [exec] tput: No value for $TERM and no -T specified
     [exec] Error when compiling po/pt_BR.po
     [exec] tput: No value for $TERM and no -T specified

BUILD FAILED
<https://ci.phpmyadmin.net/job/phpMyAdmin-continuous/ws/build.xml>:140: exec returned: 1

Total time: 17 seconds
Build step 'Invoke Ant' marked build as failure
[CHECKSTYLE] Skipping publisher since build result is FAILURE
[JSLINT] Skipping publisher since build result is FAILURE
[DRY] Collecting duplicate code analysis files...
[DRY] Searching for all files in <https://ci.phpmyadmin.net/job/phpMyAdmin-continuous/ws/> that match the pattern build/logs/pmd-cpd.xml
[DRY] No files found. Configuration error?
[DRY] Computing warning deltas based on reference build #13530
[TASKS] Skipping publisher since build result is FAILURE
[ANALYSIS-COLLECTOR] Computing warning deltas based on reference build #13530
Recording plot data
[xUnit] [INFO] - Starting to record.
[xUnit] [INFO] - Processing PHPUnit-3.x (default)
[xUnit] [INFO] - [PHPUnit-3.x (default)] - No test report file(s) were found with the pattern 'build/logs/junit.xml' relative to '<https://ci.phpmyadmin.net/job/phpMyAdmin-continuous/ws/'> for the testing framework 'PHPUnit-3.x (default)'.  Did you enter a pattern relative to the correct directory?  Did you generate the result report(s) for 'PHPUnit-3.x (default)'?
[xUnit] [ERROR] - No test reports found for the metric 'PHPUnit' with the resolved pattern 'build/logs/junit.xml'. Configuration error?.
[xUnit] [INFO] - Failing BUILD.
[xUnit] [INFO] - There are errors when processing test results.
[xUnit] [INFO] - Skipping tests recording.
[xUnit] [INFO] - Stop build.

_______________________________________________
Developers mailing list
[hidden email]
https://lists.phpmyadmin.net/mailman/listinfo/developers
Reply | Threaded
Open this post in threaded view
|

[phpMyAdmin Developers] Build failed in Jenkins: phpMyAdmin-continuous #13542

Jenkins Daemon
See <https://ci.phpmyadmin.net/job/phpMyAdmin-continuous/13542/display/redirect?page=changes>

Changes:

[weblate] Translated using Weblate (Indonesian)

------------------------------------------
Started by GitHub push by weblate
Started by GitHub push by weblate
[EnvInject] - Loading node environment variables.
Building in workspace <https://ci.phpmyadmin.net/job/phpMyAdmin-continuous/ws/>
 > git rev-parse --is-inside-work-tree # timeout=10
Fetching changes from the remote Git repository
 > git config remote.origin.url https://github.com/phpmyadmin/phpmyadmin.git # timeout=10
Fetching upstream changes from https://github.com/phpmyadmin/phpmyadmin.git
 > git --version # timeout=10
 > git fetch --tags --progress https://github.com/phpmyadmin/phpmyadmin.git +refs/heads/*:refs/remotes/origin/*
 > git rev-parse origin/master^{commit} # timeout=10
Checking out Revision 131abfe303d9ae4b291b231099d98220c05edb8e (origin/master)
Commit message: "Translated using Weblate (Indonesian)"
 > git config core.sparsecheckout # timeout=10
 > git checkout -f 131abfe303d9ae4b291b231099d98220c05edb8e
 > git rev-list 71410dfac7f6d41b10561adc9008ef2058e8f9f9 # timeout=10
 > git tag -a -f -m Jenkins Build #13542 jenkins-phpMyAdmin-continuous-13542 # timeout=10
[EnvInject] - Executing scripts and injecting environment variables after the SCM step.
[EnvInject] - Injecting as environment variables the properties content
TESTSUITE_URL=http://ci-live.phpmyadmin.net/phpMyAdmin-continuous/workspace/
TESTSUITE_USER=pmatest
TESTSUITE_DATABASE=pmatest
XTESTSUITE_BROWSERSTACK_USER=michaliha
TESTSUITE_SERVER=localhost

[EnvInject] - Variables injected successfully.
[workspace] $ /bin/sh -xe /tmp/jenkins4715691361294857710.sh
+ composer update --no-interaction
Loading composer repositories with package information
Updating dependencies (including require-dev)
Nothing to install or update
Generating autoload files
[workspace] $ ant ******** ******** clean locales phpunit-nocoverage phpcpd phpcs phploc jshint jshint-checkstyle
Unable to locate tools.jar. Expected to find it in /usr/lib/jvm/java-8-openjdk-amd64/lib/tools.jar
Buildfile: <https://ci.phpmyadmin.net/job/phpMyAdmin-continuous/ws/build.xml>

clean:
   [delete] Deleting directory <https://ci.phpmyadmin.net/job/phpMyAdmin-continuous/ws/build/api>
   [delete] Deleting directory <https://ci.phpmyadmin.net/job/phpMyAdmin-continuous/ws/build/code-browser>
   [delete] Deleting directory <https://ci.phpmyadmin.net/job/phpMyAdmin-continuous/ws/build/coverage>
   [delete] Deleting directory <https://ci.phpmyadmin.net/job/phpMyAdmin-continuous/ws/build/logs>
   [delete] Deleting directory <https://ci.phpmyadmin.net/job/phpMyAdmin-continuous/ws/build/pdepend>
    [mkdir] Created dir: <https://ci.phpmyadmin.net/job/phpMyAdmin-continuous/ws/build/api>
    [mkdir] Created dir: <https://ci.phpmyadmin.net/job/phpMyAdmin-continuous/ws/build/code-browser>
    [mkdir] Created dir: <https://ci.phpmyadmin.net/job/phpMyAdmin-continuous/ws/build/coverage>
    [mkdir] Created dir: <https://ci.phpmyadmin.net/job/phpMyAdmin-continuous/ws/build/logs>
    [mkdir] Created dir: <https://ci.phpmyadmin.net/job/phpMyAdmin-continuous/ws/build/pdepend>

locales:
     [exec] po/pt_BR.po:6745: a format specification for argument 1 doesn't exist in 'msgstr'
     [exec] msgfmt: found 1 fatal error
     [exec] tput: No value for $TERM and no -T specified
     [exec] Error when compiling po/pt_BR.po
     [exec] tput: No value for $TERM and no -T specified

BUILD FAILED
<https://ci.phpmyadmin.net/job/phpMyAdmin-continuous/ws/build.xml>:140: exec returned: 1

Total time: 14 seconds
Build step 'Invoke Ant' marked build as failure
[CHECKSTYLE] Skipping publisher since build result is FAILURE
[JSLINT] Skipping publisher since build result is FAILURE
[DRY] Collecting duplicate code analysis files...
[DRY] Searching for all files in <https://ci.phpmyadmin.net/job/phpMyAdmin-continuous/ws/> that match the pattern build/logs/pmd-cpd.xml
[DRY] No files found. Configuration error?
[DRY] Computing warning deltas based on reference build #13530
[TASKS] Skipping publisher since build result is FAILURE
[ANALYSIS-COLLECTOR] Computing warning deltas based on reference build #13530
Recording plot data
[xUnit] [INFO] - Starting to record.
[xUnit] [INFO] - Processing PHPUnit-3.x (default)
[xUnit] [INFO] - [PHPUnit-3.x (default)] - No test report file(s) were found with the pattern 'build/logs/junit.xml' relative to '<https://ci.phpmyadmin.net/job/phpMyAdmin-continuous/ws/'> for the testing framework 'PHPUnit-3.x (default)'.  Did you enter a pattern relative to the correct directory?  Did you generate the result report(s) for 'PHPUnit-3.x (default)'?
[xUnit] [ERROR] - No test reports found for the metric 'PHPUnit' with the resolved pattern 'build/logs/junit.xml'. Configuration error?.
[xUnit] [INFO] - Failing BUILD.
[xUnit] [INFO] - There are errors when processing test results.
[xUnit] [INFO] - Skipping tests recording.
[xUnit] [INFO] - Stop build.

_______________________________________________
Developers mailing list
[hidden email]
https://lists.phpmyadmin.net/mailman/listinfo/developers
Reply | Threaded
Open this post in threaded view
|

[phpMyAdmin Developers] Build failed in Jenkins: phpMyAdmin-continuous #13543

Jenkins Daemon
See <https://ci.phpmyadmin.net/job/phpMyAdmin-continuous/13543/display/redirect?page=changes>

Changes:

[weblate] Translated using Weblate (Indonesian)

------------------------------------------
Started by GitHub push by weblate
[EnvInject] - Loading node environment variables.
Building in workspace <https://ci.phpmyadmin.net/job/phpMyAdmin-continuous/ws/>
 > git rev-parse --is-inside-work-tree # timeout=10
Fetching changes from the remote Git repository
 > git config remote.origin.url https://github.com/phpmyadmin/phpmyadmin.git # timeout=10
Fetching upstream changes from https://github.com/phpmyadmin/phpmyadmin.git
 > git --version # timeout=10
 > git fetch --tags --progress https://github.com/phpmyadmin/phpmyadmin.git +refs/heads/*:refs/remotes/origin/*
 > git rev-parse origin/master^{commit} # timeout=10
Checking out Revision 843c0d74748501044ac65b195746fa030e532684 (origin/master)
Commit message: "Translated using Weblate (Indonesian)"
 > git config core.sparsecheckout # timeout=10
 > git checkout -f 843c0d74748501044ac65b195746fa030e532684
 > git rev-list 131abfe303d9ae4b291b231099d98220c05edb8e # timeout=10
 > git tag -a -f -m Jenkins Build #13543 jenkins-phpMyAdmin-continuous-13543 # timeout=10
[EnvInject] - Executing scripts and injecting environment variables after the SCM step.
[EnvInject] - Injecting as environment variables the properties content
TESTSUITE_URL=http://ci-live.phpmyadmin.net/phpMyAdmin-continuous/workspace/
TESTSUITE_USER=pmatest
TESTSUITE_DATABASE=pmatest
XTESTSUITE_BROWSERSTACK_USER=michaliha
TESTSUITE_SERVER=localhost

[EnvInject] - Variables injected successfully.
[workspace] $ /bin/sh -xe /tmp/jenkins435733335282403017.sh
+ composer update --no-interaction
Loading composer repositories with package information
Updating dependencies (including require-dev)
Nothing to install or update
Generating autoload files
[workspace] $ ant ******** ******** clean locales phpunit-nocoverage phpcpd phpcs phploc jshint jshint-checkstyle
Unable to locate tools.jar. Expected to find it in /usr/lib/jvm/java-8-openjdk-amd64/lib/tools.jar
Buildfile: <https://ci.phpmyadmin.net/job/phpMyAdmin-continuous/ws/build.xml>

clean:
   [delete] Deleting directory <https://ci.phpmyadmin.net/job/phpMyAdmin-continuous/ws/build/api>
   [delete] Deleting directory <https://ci.phpmyadmin.net/job/phpMyAdmin-continuous/ws/build/code-browser>
   [delete] Deleting directory <https://ci.phpmyadmin.net/job/phpMyAdmin-continuous/ws/build/coverage>
   [delete] Deleting directory <https://ci.phpmyadmin.net/job/phpMyAdmin-continuous/ws/build/logs>
   [delete] Deleting directory <https://ci.phpmyadmin.net/job/phpMyAdmin-continuous/ws/build/pdepend>
    [mkdir] Created dir: <https://ci.phpmyadmin.net/job/phpMyAdmin-continuous/ws/build/api>
    [mkdir] Created dir: <https://ci.phpmyadmin.net/job/phpMyAdmin-continuous/ws/build/code-browser>
    [mkdir] Created dir: <https://ci.phpmyadmin.net/job/phpMyAdmin-continuous/ws/build/coverage>
    [mkdir] Created dir: <https://ci.phpmyadmin.net/job/phpMyAdmin-continuous/ws/build/logs>
    [mkdir] Created dir: <https://ci.phpmyadmin.net/job/phpMyAdmin-continuous/ws/build/pdepend>

locales:
     [exec] po/pt_BR.po:6745: a format specification for argument 1 doesn't exist in 'msgstr'
     [exec] msgfmt: found 1 fatal error
     [exec] tput: No value for $TERM and no -T specified
     [exec] Error when compiling po/pt_BR.po
     [exec] tput: No value for $TERM and no -T specified

BUILD FAILED
<https://ci.phpmyadmin.net/job/phpMyAdmin-continuous/ws/build.xml>:140: exec returned: 1

Total time: 11 seconds
Build step 'Invoke Ant' marked build as failure
[CHECKSTYLE] Skipping publisher since build result is FAILURE
[JSLINT] Skipping publisher since build result is FAILURE
[DRY] Collecting duplicate code analysis files...
[DRY] Searching for all files in <https://ci.phpmyadmin.net/job/phpMyAdmin-continuous/ws/> that match the pattern build/logs/pmd-cpd.xml
[DRY] No files found. Configuration error?
[DRY] Computing warning deltas based on reference build #13530
[TASKS] Skipping publisher since build result is FAILURE
[ANALYSIS-COLLECTOR] Computing warning deltas based on reference build #13530
Recording plot data
[xUnit] [INFO] - Starting to record.
[xUnit] [INFO] - Processing PHPUnit-3.x (default)
[xUnit] [INFO] - [PHPUnit-3.x (default)] - No test report file(s) were found with the pattern 'build/logs/junit.xml' relative to '<https://ci.phpmyadmin.net/job/phpMyAdmin-continuous/ws/'> for the testing framework 'PHPUnit-3.x (default)'.  Did you enter a pattern relative to the correct directory?  Did you generate the result report(s) for 'PHPUnit-3.x (default)'?
[xUnit] [ERROR] - No test reports found for the metric 'PHPUnit' with the resolved pattern 'build/logs/junit.xml'. Configuration error?.
[xUnit] [INFO] - Failing BUILD.
[xUnit] [INFO] - There are errors when processing test results.
[xUnit] [INFO] - Skipping tests recording.
[xUnit] [INFO] - Stop build.

_______________________________________________
Developers mailing list
[hidden email]
https://lists.phpmyadmin.net/mailman/listinfo/developers
Reply | Threaded
Open this post in threaded view
|

[phpMyAdmin Developers] Build failed in Jenkins: phpMyAdmin-continuous #13544

Jenkins Daemon
See <https://ci.phpmyadmin.net/job/phpMyAdmin-continuous/13544/display/redirect>

------------------------------------------
Started by GitHub push by weblate
[EnvInject] - Loading node environment variables.
Building in workspace <https://ci.phpmyadmin.net/job/phpMyAdmin-continuous/ws/>
 > git rev-parse --is-inside-work-tree # timeout=10
Fetching changes from the remote Git repository
 > git config remote.origin.url https://github.com/phpmyadmin/phpmyadmin.git # timeout=10
Fetching upstream changes from https://github.com/phpmyadmin/phpmyadmin.git
 > git --version # timeout=10
 > git fetch --tags --progress https://github.com/phpmyadmin/phpmyadmin.git +refs/heads/*:refs/remotes/origin/*
 > git rev-parse origin/master^{commit} # timeout=10
Checking out Revision 843c0d74748501044ac65b195746fa030e532684 (origin/master)
Commit message: "Translated using Weblate (Indonesian)"
 > git config core.sparsecheckout # timeout=10
 > git checkout -f 843c0d74748501044ac65b195746fa030e532684
 > git rev-list 843c0d74748501044ac65b195746fa030e532684 # timeout=10
 > git tag -a -f -m Jenkins Build #13544 jenkins-phpMyAdmin-continuous-13544 # timeout=10
[EnvInject] - Executing scripts and injecting environment variables after the SCM step.
[EnvInject] - Injecting as environment variables the properties content
TESTSUITE_URL=http://ci-live.phpmyadmin.net/phpMyAdmin-continuous/workspace/
TESTSUITE_USER=pmatest
TESTSUITE_DATABASE=pmatest
XTESTSUITE_BROWSERSTACK_USER=michaliha
TESTSUITE_SERVER=localhost

[EnvInject] - Variables injected successfully.
[workspace] $ /bin/sh -xe /tmp/jenkins4703308379174183373.sh
+ composer update --no-interaction
Loading composer repositories with package information
Updating dependencies (including require-dev)
Nothing to install or update
Generating autoload files
[workspace] $ ant ******** ******** clean locales phpunit-nocoverage phpcpd phpcs phploc jshint jshint-checkstyle
Unable to locate tools.jar. Expected to find it in /usr/lib/jvm/java-8-openjdk-amd64/lib/tools.jar
Buildfile: <https://ci.phpmyadmin.net/job/phpMyAdmin-continuous/ws/build.xml>

clean:
   [delete] Deleting directory <https://ci.phpmyadmin.net/job/phpMyAdmin-continuous/ws/build/api>
   [delete] Deleting directory <https://ci.phpmyadmin.net/job/phpMyAdmin-continuous/ws/build/code-browser>
   [delete] Deleting directory <https://ci.phpmyadmin.net/job/phpMyAdmin-continuous/ws/build/coverage>
   [delete] Deleting directory <https://ci.phpmyadmin.net/job/phpMyAdmin-continuous/ws/build/logs>
   [delete] Deleting directory <https://ci.phpmyadmin.net/job/phpMyAdmin-continuous/ws/build/pdepend>
    [mkdir] Created dir: <https://ci.phpmyadmin.net/job/phpMyAdmin-continuous/ws/build/api>
    [mkdir] Created dir: <https://ci.phpmyadmin.net/job/phpMyAdmin-continuous/ws/build/code-browser>
    [mkdir] Created dir: <https://ci.phpmyadmin.net/job/phpMyAdmin-continuous/ws/build/coverage>
    [mkdir] Created dir: <https://ci.phpmyadmin.net/job/phpMyAdmin-continuous/ws/build/logs>
    [mkdir] Created dir: <https://ci.phpmyadmin.net/job/phpMyAdmin-continuous/ws/build/pdepend>

locales:
     [exec] po/pt_BR.po:6745: a format specification for argument 1 doesn't exist in 'msgstr'
     [exec] msgfmt: found 1 fatal error
     [exec] tput: No value for $TERM and no -T specified
     [exec] Error when compiling po/pt_BR.po
     [exec] tput: No value for $TERM and no -T specified

BUILD FAILED
<https://ci.phpmyadmin.net/job/phpMyAdmin-continuous/ws/build.xml>:140: exec returned: 1

Total time: 14 seconds
Build step 'Invoke Ant' marked build as failure
[CHECKSTYLE] Skipping publisher since build result is FAILURE
[JSLINT] Skipping publisher since build result is FAILURE
[DRY] Collecting duplicate code analysis files...
[DRY] Searching for all files in <https://ci.phpmyadmin.net/job/phpMyAdmin-continuous/ws/> that match the pattern build/logs/pmd-cpd.xml
[DRY] No files found. Configuration error?
[DRY] Computing warning deltas based on reference build #13530
[TASKS] Skipping publisher since build result is FAILURE
[ANALYSIS-COLLECTOR] Computing warning deltas based on reference build #13530
Recording plot data
[xUnit] [INFO] - Starting to record.
[xUnit] [INFO] - Processing PHPUnit-3.x (default)
[xUnit] [INFO] - [PHPUnit-3.x (default)] - No test report file(s) were found with the pattern 'build/logs/junit.xml' relative to '<https://ci.phpmyadmin.net/job/phpMyAdmin-continuous/ws/'> for the testing framework 'PHPUnit-3.x (default)'.  Did you enter a pattern relative to the correct directory?  Did you generate the result report(s) for 'PHPUnit-3.x (default)'?
[xUnit] [ERROR] - No test reports found for the metric 'PHPUnit' with the resolved pattern 'build/logs/junit.xml'. Configuration error?.
[xUnit] [INFO] - Failing BUILD.
[xUnit] [INFO] - There are errors when processing test results.
[xUnit] [INFO] - Skipping tests recording.
[xUnit] [INFO] - Stop build.

_______________________________________________
Developers mailing list
[hidden email]
https://lists.phpmyadmin.net/mailman/listinfo/developers
Reply | Threaded
Open this post in threaded view
|

[phpMyAdmin Developers] Build failed in Jenkins: phpMyAdmin-continuous #13545

Jenkins Daemon
See <https://ci.phpmyadmin.net/job/phpMyAdmin-continuous/13545/display/redirect?page=changes>

Changes:

[mauriciofauth] Refactor check_user_privileges to static methods

[mauriciofauth] Refactor browse_foreigners functions to static methods

[mauriciofauth] Refactor create_addfield functions to static methods

[mauriciofauth] Refactor file_listing functions to static methods

------------------------------------------
Started by GitHub push by mauriciofauth
[EnvInject] - Loading node environment variables.
Building in workspace <https://ci.phpmyadmin.net/job/phpMyAdmin-continuous/ws/>
 > git rev-parse --is-inside-work-tree # timeout=10
Fetching changes from the remote Git repository
 > git config remote.origin.url https://github.com/phpmyadmin/phpmyadmin.git # timeout=10
Fetching upstream changes from https://github.com/phpmyadmin/phpmyadmin.git
 > git --version # timeout=10
 > git fetch --tags --progress https://github.com/phpmyadmin/phpmyadmin.git +refs/heads/*:refs/remotes/origin/*
 > git rev-parse origin/master^{commit} # timeout=10
Checking out Revision 1e1c6224664e2c90891f79456cb20f12b3dc0437 (origin/master)
Commit message: "Merge pull request #13675 from mauriciofauth/functions"
 > git config core.sparsecheckout # timeout=10
 > git checkout -f 1e1c6224664e2c90891f79456cb20f12b3dc0437
 > git rev-list 843c0d74748501044ac65b195746fa030e532684 # timeout=10
 > git tag -a -f -m Jenkins Build #13545 jenkins-phpMyAdmin-continuous-13545 # timeout=10
[EnvInject] - Executing scripts and injecting environment variables after the SCM step.
[EnvInject] - Injecting as environment variables the properties content
TESTSUITE_URL=http://ci-live.phpmyadmin.net/phpMyAdmin-continuous/workspace/
TESTSUITE_USER=pmatest
TESTSUITE_DATABASE=pmatest
XTESTSUITE_BROWSERSTACK_USER=michaliha
TESTSUITE_SERVER=localhost

[EnvInject] - Variables injected successfully.
[workspace] $ /bin/sh -xe /tmp/jenkins2023978028703912989.sh
+ composer update --no-interaction
Loading composer repositories with package information
Updating dependencies (including require-dev)
Nothing to install or update
Generating autoload files
[workspace] $ ant ******** ******** clean locales phpunit-nocoverage phpcpd phpcs phploc jshint jshint-checkstyle
Unable to locate tools.jar. Expected to find it in /usr/lib/jvm/java-8-openjdk-amd64/lib/tools.jar
Buildfile: <https://ci.phpmyadmin.net/job/phpMyAdmin-continuous/ws/build.xml>

clean:
   [delete] Deleting directory <https://ci.phpmyadmin.net/job/phpMyAdmin-continuous/ws/build/api>
   [delete] Deleting directory <https://ci.phpmyadmin.net/job/phpMyAdmin-continuous/ws/build/code-browser>
   [delete] Deleting directory <https://ci.phpmyadmin.net/job/phpMyAdmin-continuous/ws/build/coverage>
   [delete] Deleting directory <https://ci.phpmyadmin.net/job/phpMyAdmin-continuous/ws/build/logs>
   [delete] Deleting directory <https://ci.phpmyadmin.net/job/phpMyAdmin-continuous/ws/build/pdepend>
    [mkdir] Created dir: <https://ci.phpmyadmin.net/job/phpMyAdmin-continuous/ws/build/api>
    [mkdir] Created dir: <https://ci.phpmyadmin.net/job/phpMyAdmin-continuous/ws/build/code-browser>
    [mkdir] Created dir: <https://ci.phpmyadmin.net/job/phpMyAdmin-continuous/ws/build/coverage>
    [mkdir] Created dir: <https://ci.phpmyadmin.net/job/phpMyAdmin-continuous/ws/build/logs>
    [mkdir] Created dir: <https://ci.phpmyadmin.net/job/phpMyAdmin-continuous/ws/build/pdepend>

locales:
     [exec] po/pt_BR.po:6745: a format specification for argument 1 doesn't exist in 'msgstr'
     [exec] msgfmt: found 1 fatal error
     [exec] tput: No value for $TERM and no -T specified
     [exec] Error when compiling po/pt_BR.po
     [exec] tput: No value for $TERM and no -T specified

BUILD FAILED
<https://ci.phpmyadmin.net/job/phpMyAdmin-continuous/ws/build.xml>:140: exec returned: 1

Total time: 12 seconds
Build step 'Invoke Ant' marked build as failure
[CHECKSTYLE] Skipping publisher since build result is FAILURE
[JSLINT] Skipping publisher since build result is FAILURE
[DRY] Collecting duplicate code analysis files...
[DRY] Searching for all files in <https://ci.phpmyadmin.net/job/phpMyAdmin-continuous/ws/> that match the pattern build/logs/pmd-cpd.xml
[DRY] No files found. Configuration error?
[DRY] Computing warning deltas based on reference build #13530
[TASKS] Skipping publisher since build result is FAILURE
[ANALYSIS-COLLECTOR] Computing warning deltas based on reference build #13530
Recording plot data
[xUnit] [INFO] - Starting to record.
[xUnit] [INFO] - Processing PHPUnit-3.x (default)
[xUnit] [INFO] - [PHPUnit-3.x (default)] - No test report file(s) were found with the pattern 'build/logs/junit.xml' relative to '<https://ci.phpmyadmin.net/job/phpMyAdmin-continuous/ws/'> for the testing framework 'PHPUnit-3.x (default)'.  Did you enter a pattern relative to the correct directory?  Did you generate the result report(s) for 'PHPUnit-3.x (default)'?
[xUnit] [ERROR] - No test reports found for the metric 'PHPUnit' with the resolved pattern 'build/logs/junit.xml'. Configuration error?.
[xUnit] [INFO] - Failing BUILD.
[xUnit] [INFO] - There are errors when processing test results.
[xUnit] [INFO] - Skipping tests recording.
[xUnit] [INFO] - Stop build.

_______________________________________________
Developers mailing list
[hidden email]
https://lists.phpmyadmin.net/mailman/listinfo/developers
Reply | Threaded
Open this post in threaded view
|

[phpMyAdmin Developers] Jenkins build is back to normal : phpMyAdmin-continuous #13546

Jenkins Daemon