[phpMyAdmin Developers] Build failed in Jenkins: phpMyAdmin-continuous #13375

classic Classic list List threaded Threaded
4 messages Options
Reply | Threaded
Open this post in threaded view
|

[phpMyAdmin Developers] Build failed in Jenkins: phpMyAdmin-continuous #13375

Jenkins Daemon
See <https://ci.phpmyadmin.net/job/phpMyAdmin-continuous/13375/display/redirect?page=changes>

Changes:

[Michal Čihař] Use tryQuery instead of query to handle errors

[Michal Čihař] Better handle situation where debug_backtrace is disabled

------------------------------------------
[...truncated 20.60 KB...]
     [exec]
     [exec] 31) PMA_SeleniumExportTest::testDbExport with data set #2 ('JSON', array('{"id":"1","val":"2"}'))
     [exec] Selenium testing not configured.
     [exec]
     [exec] <https://ci.phpmyadmin.net/job/phpMyAdmin-continuous/ws/test/selenium/TestBase.php>:169
     [exec] <https://ci.phpmyadmin.net/job/phpMyAdmin-continuous/ws/test/selenium/PmaSeleniumExportTest.php>:28
     [exec]
     [exec] 32) PMA_SeleniumExportTest::testTableExport with data set #0 ('CSV', array('"1","2"'))
     [exec] Selenium testing not configured.
     [exec]
     [exec] <https://ci.phpmyadmin.net/job/phpMyAdmin-continuous/ws/test/selenium/TestBase.php>:169
     [exec] <https://ci.phpmyadmin.net/job/phpMyAdmin-continuous/ws/test/selenium/PmaSeleniumExportTest.php>:28
     [exec]
     [exec] 33) PMA_SeleniumExportTest::testTableExport with data set #1 ('SQL', array('CREATE TABLE IF NOT EXISTS `t...table`', 'INSERT INTO `test_table` (`id...VALUES', '(1, 2)'))
     [exec] Selenium testing not configured.
     [exec]
     [exec] <https://ci.phpmyadmin.net/job/phpMyAdmin-continuous/ws/test/selenium/TestBase.php>:169
     [exec] <https://ci.phpmyadmin.net/job/phpMyAdmin-continuous/ws/test/selenium/PmaSeleniumExportTest.php>:28
     [exec]
     [exec] 34) PMA_SeleniumExportTest::testTableExport with data set #2 ('JSON', array('{"id":"1","val":"2"}'))
     [exec] Selenium testing not configured.
     [exec]
     [exec] <https://ci.phpmyadmin.net/job/phpMyAdmin-continuous/ws/test/selenium/TestBase.php>:169
     [exec] <https://ci.phpmyadmin.net/job/phpMyAdmin-continuous/ws/test/selenium/PmaSeleniumExportTest.php>:28
     [exec]
     [exec] 35) PMA_SeleniumImportTest::testServerImport
     [exec] Selenium testing not configured.
     [exec]
     [exec] <https://ci.phpmyadmin.net/job/phpMyAdmin-continuous/ws/test/selenium/TestBase.php>:169
     [exec]
     [exec] 36) PMA_SeleniumImportTest::testDbImport
     [exec] Selenium testing not configured.
     [exec]
     [exec] <https://ci.phpmyadmin.net/job/phpMyAdmin-continuous/ws/test/selenium/TestBase.php>:169
     [exec]
     [exec] 37) PMA_SeleniumImportTest::testTableImport
     [exec] Selenium testing not configured.
     [exec]
     [exec] <https://ci.phpmyadmin.net/job/phpMyAdmin-continuous/ws/test/selenium/TestBase.php>:169
     [exec]
     [exec] 38) PMA_SeleniumLoginTest::testSuccessfulLogin
     [exec] Selenium testing not configured.
     [exec]
     [exec] <https://ci.phpmyadmin.net/job/phpMyAdmin-continuous/ws/test/selenium/TestBase.php>:169
     [exec]
     [exec] 39) PMA_SeleniumLoginTest::testLoginWithWrongPassword
     [exec] Selenium testing not configured.
     [exec]
     [exec] <https://ci.phpmyadmin.net/job/phpMyAdmin-continuous/ws/test/selenium/TestBase.php>:169
     [exec]
     [exec] 40) PMA_SeleniumNormalizationTest::testNormalizationTo1NF
     [exec] Selenium testing not configured.
     [exec]
     [exec] <https://ci.phpmyadmin.net/job/phpMyAdmin-continuous/ws/test/selenium/TestBase.php>:169
     [exec] <https://ci.phpmyadmin.net/job/phpMyAdmin-continuous/ws/test/selenium/PmaSeleniumNormalizationTest.php>:28
     [exec]
     [exec] 41) PmaSeleniumQueryByExampleTest::testQueryByExample
     [exec] Selenium testing not configured.
     [exec]
     [exec] <https://ci.phpmyadmin.net/job/phpMyAdmin-continuous/ws/test/selenium/TestBase.php>:169
     [exec] <https://ci.phpmyadmin.net/job/phpMyAdmin-continuous/ws/test/selenium/PmaSeleniumQueryByExampleTest.php>:29
     [exec]
     [exec] 42) PMA_SeleniumSettingsTest::testHideDatabase
     [exec] Selenium testing not configured.
     [exec]
     [exec] <https://ci.phpmyadmin.net/job/phpMyAdmin-continuous/ws/test/selenium/TestBase.php>:169
     [exec]
     [exec] 43) PMA_SeleniumSettingsTest::testSettingsTabsAreDisplayed
     [exec] Selenium testing not configured.
     [exec]
     [exec] <https://ci.phpmyadmin.net/job/phpMyAdmin-continuous/ws/test/selenium/TestBase.php>:169
     [exec]
     [exec] 44) PMA_SeleniumSettingsTest::testHideLogo
     [exec] Selenium testing not configured.
     [exec]
     [exec] <https://ci.phpmyadmin.net/job/phpMyAdmin-continuous/ws/test/selenium/TestBase.php>:169
     [exec]
     [exec] 45) PMA_SeleniumSqlQueryTest::testServerSqlQuery
     [exec] Selenium testing not configured.
     [exec]
     [exec] <https://ci.phpmyadmin.net/job/phpMyAdmin-continuous/ws/test/selenium/TestBase.php>:169
     [exec] <https://ci.phpmyadmin.net/job/phpMyAdmin-continuous/ws/test/selenium/PmaSeleniumSqlQueryTest.php>:29
     [exec]
     [exec] 46) PMA_SeleniumSqlQueryTest::testDatabaseSqlQuery
     [exec] Selenium testing not configured.
     [exec]
     [exec] <https://ci.phpmyadmin.net/job/phpMyAdmin-continuous/ws/test/selenium/TestBase.php>:169
     [exec] <https://ci.phpmyadmin.net/job/phpMyAdmin-continuous/ws/test/selenium/PmaSeleniumSqlQueryTest.php>:29
     [exec]
     [exec] 47) PMA_SeleniumSqlQueryTest::testTableSqlQuery
     [exec] Selenium testing not configured.
     [exec]
     [exec] <https://ci.phpmyadmin.net/job/phpMyAdmin-continuous/ws/test/selenium/TestBase.php>:169
     [exec] <https://ci.phpmyadmin.net/job/phpMyAdmin-continuous/ws/test/selenium/PmaSeleniumSqlQueryTest.php>:29
     [exec]
     [exec] 48) PMA_SeleniumTableBrowseTest::testSortRecords
     [exec] Selenium testing not configured.
     [exec]
     [exec] <https://ci.phpmyadmin.net/job/phpMyAdmin-continuous/ws/test/selenium/TestBase.php>:169
     [exec] <https://ci.phpmyadmin.net/job/phpMyAdmin-continuous/ws/test/selenium/PmaSeleniumTableBrowseTest.php>:28
     [exec]
     [exec] 49) PMA_SeleniumTableBrowseTest::testChangeRecords
     [exec] Selenium testing not configured.
     [exec]
     [exec] <https://ci.phpmyadmin.net/job/phpMyAdmin-continuous/ws/test/selenium/TestBase.php>:169
     [exec] <https://ci.phpmyadmin.net/job/phpMyAdmin-continuous/ws/test/selenium/PmaSeleniumTableBrowseTest.php>:28
     [exec]
     [exec] 50) PMA_SeleniumTableBrowseTest::testChangeRecordsByDoubleClick
     [exec] Selenium testing not configured.
     [exec]
     [exec] <https://ci.phpmyadmin.net/job/phpMyAdmin-continuous/ws/test/selenium/TestBase.php>:169
     [exec] <https://ci.phpmyadmin.net/job/phpMyAdmin-continuous/ws/test/selenium/PmaSeleniumTableBrowseTest.php>:28
     [exec]
     [exec] 51) PMA_SeleniumTableBrowseTest::testCopyRecords
     [exec] Selenium testing not configured.
     [exec]
     [exec] <https://ci.phpmyadmin.net/job/phpMyAdmin-continuous/ws/test/selenium/TestBase.php>:169
     [exec] <https://ci.phpmyadmin.net/job/phpMyAdmin-continuous/ws/test/selenium/PmaSeleniumTableBrowseTest.php>:28
     [exec]
     [exec] 52) PMA_SeleniumTableBrowseTest::testSearchRecords
     [exec] Selenium testing not configured.
     [exec]
     [exec] <https://ci.phpmyadmin.net/job/phpMyAdmin-continuous/ws/test/selenium/TestBase.php>:169
     [exec] <https://ci.phpmyadmin.net/job/phpMyAdmin-continuous/ws/test/selenium/PmaSeleniumTableBrowseTest.php>:28
     [exec]
     [exec] 53) PMA_SeleniumTableBrowseTest::testDeleteRecords
     [exec] Selenium testing not configured.
     [exec]
     [exec] <https://ci.phpmyadmin.net/job/phpMyAdmin-continuous/ws/test/selenium/TestBase.php>:169
     [exec] <https://ci.phpmyadmin.net/job/phpMyAdmin-continuous/ws/test/selenium/PmaSeleniumTableBrowseTest.php>:28
     [exec]
     [exec] 54) PMA_SeleniumTableCreateTest::testCreateTable
     [exec] Selenium testing not configured.
     [exec]
     [exec] <https://ci.phpmyadmin.net/job/phpMyAdmin-continuous/ws/test/selenium/TestBase.php>:169
     [exec]
     [exec] 55) PMA_SeleniumTableInsertTest::testAddData
     [exec] Selenium testing not configured.
     [exec]
     [exec] <https://ci.phpmyadmin.net/job/phpMyAdmin-continuous/ws/test/selenium/TestBase.php>:169
     [exec] <https://ci.phpmyadmin.net/job/phpMyAdmin-continuous/ws/test/selenium/PmaSeleniumTableInsertTest.php>:29
     [exec]
     [exec] 56) PMA_SeleniumTableOperationsTest::testChangeTableOrder
     [exec] Selenium testing not configured.
     [exec]
     [exec] <https://ci.phpmyadmin.net/job/phpMyAdmin-continuous/ws/test/selenium/TestBase.php>:169
     [exec] <https://ci.phpmyadmin.net/job/phpMyAdmin-continuous/ws/test/selenium/PmaSeleniumTableOperationsTest.php>:28
     [exec]
     [exec] 57) PMA_SeleniumTableOperationsTest::testMoveTable
     [exec] Selenium testing not configured.
     [exec]
     [exec] <https://ci.phpmyadmin.net/job/phpMyAdmin-continuous/ws/test/selenium/TestBase.php>:169
     [exec] <https://ci.phpmyadmin.net/job/phpMyAdmin-continuous/ws/test/selenium/PmaSeleniumTableOperationsTest.php>:28
     [exec]
     [exec] 58) PMA_SeleniumTableOperationsTest::testRenameTable
     [exec] Selenium testing not configured.
     [exec]
     [exec] <https://ci.phpmyadmin.net/job/phpMyAdmin-continuous/ws/test/selenium/TestBase.php>:169
     [exec] <https://ci.phpmyadmin.net/job/phpMyAdmin-continuous/ws/test/selenium/PmaSeleniumTableOperationsTest.php>:28
     [exec]
     [exec] 59) PMA_SeleniumTableOperationsTest::testCopyTable
     [exec] Selenium testing not configured.
     [exec]
     [exec] <https://ci.phpmyadmin.net/job/phpMyAdmin-continuous/ws/test/selenium/TestBase.php>:169
     [exec] <https://ci.phpmyadmin.net/job/phpMyAdmin-continuous/ws/test/selenium/PmaSeleniumTableOperationsTest.php>:28
     [exec]
     [exec] 60) PMA_SeleniumTableOperationsTest::testTruncateTable
     [exec] Selenium testing not configured.
     [exec]
     [exec] <https://ci.phpmyadmin.net/job/phpMyAdmin-continuous/ws/test/selenium/TestBase.php>:169
     [exec] <https://ci.phpmyadmin.net/job/phpMyAdmin-continuous/ws/test/selenium/PmaSeleniumTableOperationsTest.php>:28
     [exec]
     [exec] 61) PMA_SeleniumTableOperationsTest::testDropTable
     [exec] Selenium testing not configured.
     [exec]
     [exec] <https://ci.phpmyadmin.net/job/phpMyAdmin-continuous/ws/test/selenium/TestBase.php>:169
     [exec] <https://ci.phpmyadmin.net/job/phpMyAdmin-continuous/ws/test/selenium/PmaSeleniumTableOperationsTest.php>:28
     [exec]
     [exec] 62) PMA_SeleniumTableStructureTest::testAddColumn
     [exec] Selenium testing not configured.
     [exec]
     [exec] <https://ci.phpmyadmin.net/job/phpMyAdmin-continuous/ws/test/selenium/TestBase.php>:169
     [exec] <https://ci.phpmyadmin.net/job/phpMyAdmin-continuous/ws/test/selenium/PmaSeleniumTableStructureTest.php>:28
     [exec]
     [exec] 63) PMA_SeleniumTableStructureTest::testChangeColumn
     [exec] Selenium testing not configured.
     [exec]
     [exec] <https://ci.phpmyadmin.net/job/phpMyAdmin-continuous/ws/test/selenium/TestBase.php>:169
     [exec] <https://ci.phpmyadmin.net/job/phpMyAdmin-continuous/ws/test/selenium/PmaSeleniumTableStructureTest.php>:28
     [exec]
     [exec] 64) PMA_SeleniumTableStructureTest::testDropColumns
     [exec] Selenium testing not configured.
     [exec]
     [exec] <https://ci.phpmyadmin.net/job/phpMyAdmin-continuous/ws/test/selenium/TestBase.php>:169
     [exec] <https://ci.phpmyadmin.net/job/phpMyAdmin-continuous/ws/test/selenium/PmaSeleniumTableStructureTest.php>:28
     [exec]
     [exec] 65) PMA_SeleniumTrackingTest::testTrackingData
     [exec] Selenium testing not configured.
     [exec]
     [exec] <https://ci.phpmyadmin.net/job/phpMyAdmin-continuous/ws/test/selenium/TestBase.php>:169
     [exec] <https://ci.phpmyadmin.net/job/phpMyAdmin-continuous/ws/test/selenium/PmaSeleniumTrackingTest.php>:28
     [exec]
     [exec] 66) PMA_SeleniumTrackingTest::testDeactivateTracking
     [exec] Selenium testing not configured.
     [exec]
     [exec] <https://ci.phpmyadmin.net/job/phpMyAdmin-continuous/ws/test/selenium/TestBase.php>:169
     [exec] <https://ci.phpmyadmin.net/job/phpMyAdmin-continuous/ws/test/selenium/PmaSeleniumTrackingTest.php>:28
     [exec]
     [exec] 67) PMA_SeleniumTrackingTest::testDropTracking
     [exec] Selenium testing not configured.
     [exec]
     [exec] <https://ci.phpmyadmin.net/job/phpMyAdmin-continuous/ws/test/selenium/TestBase.php>:169
     [exec] <https://ci.phpmyadmin.net/job/phpMyAdmin-continuous/ws/test/selenium/PmaSeleniumTrackingTest.php>:28
     [exec]
     [exec] 68) PMA_SeleniumTrackingTest::testStructureSnapshot
     [exec] Selenium testing not configured.
     [exec]
     [exec] <https://ci.phpmyadmin.net/job/phpMyAdmin-continuous/ws/test/selenium/TestBase.php>:169
     [exec] <https://ci.phpmyadmin.net/job/phpMyAdmin-continuous/ws/test/selenium/PmaSeleniumTrackingTest.php>:28
     [exec]
     [exec] 69) PMA_SeleniumXSSTest::testQueryTabWithNullValue
     [exec] Selenium testing not configured.
     [exec]
     [exec] <https://ci.phpmyadmin.net/job/phpMyAdmin-continuous/ws/test/selenium/TestBase.php>:169
     [exec]
     [exec] FAILURES!
     [exec] Tests: 2363, Assertions: 6378, Failures: 3, Skipped: 69, Incomplete: 5, Risky: 1.

BUILD FAILED
<https://ci.phpmyadmin.net/job/phpMyAdmin-continuous/ws/build.xml>:33: exec returned: 1

Total time: 20 seconds
Build step 'Invoke Ant' marked build as failure
[CHECKSTYLE] Skipping publisher since build result is FAILURE
[JSLINT] Skipping publisher since build result is FAILURE
[DRY] Collecting duplicate code analysis files...
[DRY] Searching for all files in <https://ci.phpmyadmin.net/job/phpMyAdmin-continuous/ws/> that match the pattern build/logs/pmd-cpd.xml
[DRY] No files found. Configuration error?
[DRY] Computing warning deltas based on reference build #13374
[TASKS] Skipping publisher since build result is FAILURE
[ANALYSIS-COLLECTOR] Computing warning deltas based on reference build #13374
Recording plot data
[xUnit] [INFO] - Starting to record.
[xUnit] [INFO] - Processing PHPUnit-3.x (default)
[xUnit] [INFO] - [PHPUnit-3.x (default)] - 1 test report file(s) were found with the pattern 'build/logs/junit.xml' relative to '<https://ci.phpmyadmin.net/job/phpMyAdmin-continuous/ws/'> for the testing framework 'PHPUnit-3.x (default)'.
[xUnit] [INFO] - Check 'Failed Tests' threshold.
[xUnit] [INFO] - Check 'Skipped Tests' threshold.
[xUnit] [INFO] - Setting the build status to FAILURE
[xUnit] [INFO] - Stopping recording.

_______________________________________________
Developers mailing list
[hidden email]
https://lists.phpmyadmin.net/mailman/listinfo/developers
Reply | Threaded
Open this post in threaded view
|

[phpMyAdmin Developers] Build failed in Jenkins: phpMyAdmin-continuous #13376

Jenkins Daemon
See <https://ci.phpmyadmin.net/job/phpMyAdmin-continuous/13376/display/redirect?page=changes>

Changes:

[Michal Čihař] Adjust tests to changed API usage in SQL export

------------------------------------------
[...truncated 19.04 KB...]
     [exec]
     [exec] 31) PMA_SeleniumExportTest::testDbExport with data set #2 ('JSON', array('{"id":"1","val":"2"}'))
     [exec] Selenium testing not configured.
     [exec]
     [exec] <https://ci.phpmyadmin.net/job/phpMyAdmin-continuous/ws/test/selenium/TestBase.php>:169
     [exec] <https://ci.phpmyadmin.net/job/phpMyAdmin-continuous/ws/test/selenium/PmaSeleniumExportTest.php>:28
     [exec]
     [exec] 32) PMA_SeleniumExportTest::testTableExport with data set #0 ('CSV', array('"1","2"'))
     [exec] Selenium testing not configured.
     [exec]
     [exec] <https://ci.phpmyadmin.net/job/phpMyAdmin-continuous/ws/test/selenium/TestBase.php>:169
     [exec] <https://ci.phpmyadmin.net/job/phpMyAdmin-continuous/ws/test/selenium/PmaSeleniumExportTest.php>:28
     [exec]
     [exec] 33) PMA_SeleniumExportTest::testTableExport with data set #1 ('SQL', array('CREATE TABLE IF NOT EXISTS `t...table`', 'INSERT INTO `test_table` (`id...VALUES', '(1, 2)'))
     [exec] Selenium testing not configured.
     [exec]
     [exec] <https://ci.phpmyadmin.net/job/phpMyAdmin-continuous/ws/test/selenium/TestBase.php>:169
     [exec] <https://ci.phpmyadmin.net/job/phpMyAdmin-continuous/ws/test/selenium/PmaSeleniumExportTest.php>:28
     [exec]
     [exec] 34) PMA_SeleniumExportTest::testTableExport with data set #2 ('JSON', array('{"id":"1","val":"2"}'))
     [exec] Selenium testing not configured.
     [exec]
     [exec] <https://ci.phpmyadmin.net/job/phpMyAdmin-continuous/ws/test/selenium/TestBase.php>:169
     [exec] <https://ci.phpmyadmin.net/job/phpMyAdmin-continuous/ws/test/selenium/PmaSeleniumExportTest.php>:28
     [exec]
     [exec] 35) PMA_SeleniumImportTest::testServerImport
     [exec] Selenium testing not configured.
     [exec]
     [exec] <https://ci.phpmyadmin.net/job/phpMyAdmin-continuous/ws/test/selenium/TestBase.php>:169
     [exec]
     [exec] 36) PMA_SeleniumImportTest::testDbImport
     [exec] Selenium testing not configured.
     [exec]
     [exec] <https://ci.phpmyadmin.net/job/phpMyAdmin-continuous/ws/test/selenium/TestBase.php>:169
     [exec]
     [exec] 37) PMA_SeleniumImportTest::testTableImport
     [exec] Selenium testing not configured.
     [exec]
     [exec] <https://ci.phpmyadmin.net/job/phpMyAdmin-continuous/ws/test/selenium/TestBase.php>:169
     [exec]
     [exec] 38) PMA_SeleniumLoginTest::testSuccessfulLogin
     [exec] Selenium testing not configured.
     [exec]
     [exec] <https://ci.phpmyadmin.net/job/phpMyAdmin-continuous/ws/test/selenium/TestBase.php>:169
     [exec]
     [exec] 39) PMA_SeleniumLoginTest::testLoginWithWrongPassword
     [exec] Selenium testing not configured.
     [exec]
     [exec] <https://ci.phpmyadmin.net/job/phpMyAdmin-continuous/ws/test/selenium/TestBase.php>:169
     [exec]
     [exec] 40) PMA_SeleniumNormalizationTest::testNormalizationTo1NF
     [exec] Selenium testing not configured.
     [exec]
     [exec] <https://ci.phpmyadmin.net/job/phpMyAdmin-continuous/ws/test/selenium/TestBase.php>:169
     [exec] <https://ci.phpmyadmin.net/job/phpMyAdmin-continuous/ws/test/selenium/PmaSeleniumNormalizationTest.php>:28
     [exec]
     [exec] 41) PmaSeleniumQueryByExampleTest::testQueryByExample
     [exec] Selenium testing not configured.
     [exec]
     [exec] <https://ci.phpmyadmin.net/job/phpMyAdmin-continuous/ws/test/selenium/TestBase.php>:169
     [exec] <https://ci.phpmyadmin.net/job/phpMyAdmin-continuous/ws/test/selenium/PmaSeleniumQueryByExampleTest.php>:29
     [exec]
     [exec] 42) PMA_SeleniumSettingsTest::testHideDatabase
     [exec] Selenium testing not configured.
     [exec]
     [exec] <https://ci.phpmyadmin.net/job/phpMyAdmin-continuous/ws/test/selenium/TestBase.php>:169
     [exec]
     [exec] 43) PMA_SeleniumSettingsTest::testSettingsTabsAreDisplayed
     [exec] Selenium testing not configured.
     [exec]
     [exec] <https://ci.phpmyadmin.net/job/phpMyAdmin-continuous/ws/test/selenium/TestBase.php>:169
     [exec]
     [exec] 44) PMA_SeleniumSettingsTest::testHideLogo
     [exec] Selenium testing not configured.
     [exec]
     [exec] <https://ci.phpmyadmin.net/job/phpMyAdmin-continuous/ws/test/selenium/TestBase.php>:169
     [exec]
     [exec] 45) PMA_SeleniumSqlQueryTest::testServerSqlQuery
     [exec] Selenium testing not configured.
     [exec]
     [exec] <https://ci.phpmyadmin.net/job/phpMyAdmin-continuous/ws/test/selenium/TestBase.php>:169
     [exec] <https://ci.phpmyadmin.net/job/phpMyAdmin-continuous/ws/test/selenium/PmaSeleniumSqlQueryTest.php>:29
     [exec]
     [exec] 46) PMA_SeleniumSqlQueryTest::testDatabaseSqlQuery
     [exec] Selenium testing not configured.
     [exec]
     [exec] <https://ci.phpmyadmin.net/job/phpMyAdmin-continuous/ws/test/selenium/TestBase.php>:169
     [exec] <https://ci.phpmyadmin.net/job/phpMyAdmin-continuous/ws/test/selenium/PmaSeleniumSqlQueryTest.php>:29
     [exec]
     [exec] 47) PMA_SeleniumSqlQueryTest::testTableSqlQuery
     [exec] Selenium testing not configured.
     [exec]
     [exec] <https://ci.phpmyadmin.net/job/phpMyAdmin-continuous/ws/test/selenium/TestBase.php>:169
     [exec] <https://ci.phpmyadmin.net/job/phpMyAdmin-continuous/ws/test/selenium/PmaSeleniumSqlQueryTest.php>:29
     [exec]
     [exec] 48) PMA_SeleniumTableBrowseTest::testSortRecords
     [exec] Selenium testing not configured.
     [exec]
     [exec] <https://ci.phpmyadmin.net/job/phpMyAdmin-continuous/ws/test/selenium/TestBase.php>:169
     [exec] <https://ci.phpmyadmin.net/job/phpMyAdmin-continuous/ws/test/selenium/PmaSeleniumTableBrowseTest.php>:28
     [exec]
     [exec] 49) PMA_SeleniumTableBrowseTest::testChangeRecords
     [exec] Selenium testing not configured.
     [exec]
     [exec] <https://ci.phpmyadmin.net/job/phpMyAdmin-continuous/ws/test/selenium/TestBase.php>:169
     [exec] <https://ci.phpmyadmin.net/job/phpMyAdmin-continuous/ws/test/selenium/PmaSeleniumTableBrowseTest.php>:28
     [exec]
     [exec] 50) PMA_SeleniumTableBrowseTest::testChangeRecordsByDoubleClick
     [exec] Selenium testing not configured.
     [exec]
     [exec] <https://ci.phpmyadmin.net/job/phpMyAdmin-continuous/ws/test/selenium/TestBase.php>:169
     [exec] <https://ci.phpmyadmin.net/job/phpMyAdmin-continuous/ws/test/selenium/PmaSeleniumTableBrowseTest.php>:28
     [exec]
     [exec] 51) PMA_SeleniumTableBrowseTest::testCopyRecords
     [exec] Selenium testing not configured.
     [exec]
     [exec] <https://ci.phpmyadmin.net/job/phpMyAdmin-continuous/ws/test/selenium/TestBase.php>:169
     [exec] <https://ci.phpmyadmin.net/job/phpMyAdmin-continuous/ws/test/selenium/PmaSeleniumTableBrowseTest.php>:28
     [exec]
     [exec] 52) PMA_SeleniumTableBrowseTest::testSearchRecords
     [exec] Selenium testing not configured.
     [exec]
     [exec] <https://ci.phpmyadmin.net/job/phpMyAdmin-continuous/ws/test/selenium/TestBase.php>:169
     [exec] <https://ci.phpmyadmin.net/job/phpMyAdmin-continuous/ws/test/selenium/PmaSeleniumTableBrowseTest.php>:28
     [exec]
     [exec] 53) PMA_SeleniumTableBrowseTest::testDeleteRecords
     [exec] Selenium testing not configured.
     [exec]
     [exec] <https://ci.phpmyadmin.net/job/phpMyAdmin-continuous/ws/test/selenium/TestBase.php>:169
     [exec] <https://ci.phpmyadmin.net/job/phpMyAdmin-continuous/ws/test/selenium/PmaSeleniumTableBrowseTest.php>:28
     [exec]
     [exec] 54) PMA_SeleniumTableCreateTest::testCreateTable
     [exec] Selenium testing not configured.
     [exec]
     [exec] <https://ci.phpmyadmin.net/job/phpMyAdmin-continuous/ws/test/selenium/TestBase.php>:169
     [exec]
     [exec] 55) PMA_SeleniumTableInsertTest::testAddData
     [exec] Selenium testing not configured.
     [exec]
     [exec] <https://ci.phpmyadmin.net/job/phpMyAdmin-continuous/ws/test/selenium/TestBase.php>:169
     [exec] <https://ci.phpmyadmin.net/job/phpMyAdmin-continuous/ws/test/selenium/PmaSeleniumTableInsertTest.php>:29
     [exec]
     [exec] 56) PMA_SeleniumTableOperationsTest::testChangeTableOrder
     [exec] Selenium testing not configured.
     [exec]
     [exec] <https://ci.phpmyadmin.net/job/phpMyAdmin-continuous/ws/test/selenium/TestBase.php>:169
     [exec] <https://ci.phpmyadmin.net/job/phpMyAdmin-continuous/ws/test/selenium/PmaSeleniumTableOperationsTest.php>:28
     [exec]
     [exec] 57) PMA_SeleniumTableOperationsTest::testMoveTable
     [exec] Selenium testing not configured.
     [exec]
     [exec] <https://ci.phpmyadmin.net/job/phpMyAdmin-continuous/ws/test/selenium/TestBase.php>:169
     [exec] <https://ci.phpmyadmin.net/job/phpMyAdmin-continuous/ws/test/selenium/PmaSeleniumTableOperationsTest.php>:28
     [exec]
     [exec] 58) PMA_SeleniumTableOperationsTest::testRenameTable
     [exec] Selenium testing not configured.
     [exec]
     [exec] <https://ci.phpmyadmin.net/job/phpMyAdmin-continuous/ws/test/selenium/TestBase.php>:169
     [exec] <https://ci.phpmyadmin.net/job/phpMyAdmin-continuous/ws/test/selenium/PmaSeleniumTableOperationsTest.php>:28
     [exec]
     [exec] 59) PMA_SeleniumTableOperationsTest::testCopyTable
     [exec] Selenium testing not configured.
     [exec]
     [exec] <https://ci.phpmyadmin.net/job/phpMyAdmin-continuous/ws/test/selenium/TestBase.php>:169
     [exec] <https://ci.phpmyadmin.net/job/phpMyAdmin-continuous/ws/test/selenium/PmaSeleniumTableOperationsTest.php>:28
     [exec]
     [exec] 60) PMA_SeleniumTableOperationsTest::testTruncateTable
     [exec] Selenium testing not configured.
     [exec]
     [exec] <https://ci.phpmyadmin.net/job/phpMyAdmin-continuous/ws/test/selenium/TestBase.php>:169
     [exec] <https://ci.phpmyadmin.net/job/phpMyAdmin-continuous/ws/test/selenium/PmaSeleniumTableOperationsTest.php>:28
     [exec]
     [exec] 61) PMA_SeleniumTableOperationsTest::testDropTable
     [exec] Selenium testing not configured.
     [exec]
     [exec] <https://ci.phpmyadmin.net/job/phpMyAdmin-continuous/ws/test/selenium/TestBase.php>:169
     [exec] <https://ci.phpmyadmin.net/job/phpMyAdmin-continuous/ws/test/selenium/PmaSeleniumTableOperationsTest.php>:28
     [exec]
     [exec] 62) PMA_SeleniumTableStructureTest::testAddColumn
     [exec] Selenium testing not configured.
     [exec]
     [exec] <https://ci.phpmyadmin.net/job/phpMyAdmin-continuous/ws/test/selenium/TestBase.php>:169
     [exec] <https://ci.phpmyadmin.net/job/phpMyAdmin-continuous/ws/test/selenium/PmaSeleniumTableStructureTest.php>:28
     [exec]
     [exec] 63) PMA_SeleniumTableStructureTest::testChangeColumn
     [exec] Selenium testing not configured.
     [exec]
     [exec] <https://ci.phpmyadmin.net/job/phpMyAdmin-continuous/ws/test/selenium/TestBase.php>:169
     [exec] <https://ci.phpmyadmin.net/job/phpMyAdmin-continuous/ws/test/selenium/PmaSeleniumTableStructureTest.php>:28
     [exec]
     [exec] 64) PMA_SeleniumTableStructureTest::testDropColumns
     [exec] Selenium testing not configured.
     [exec]
     [exec] <https://ci.phpmyadmin.net/job/phpMyAdmin-continuous/ws/test/selenium/TestBase.php>:169
     [exec] <https://ci.phpmyadmin.net/job/phpMyAdmin-continuous/ws/test/selenium/PmaSeleniumTableStructureTest.php>:28
     [exec]
     [exec] 65) PMA_SeleniumTrackingTest::testTrackingData
     [exec] Selenium testing not configured.
     [exec]
     [exec] <https://ci.phpmyadmin.net/job/phpMyAdmin-continuous/ws/test/selenium/TestBase.php>:169
     [exec] <https://ci.phpmyadmin.net/job/phpMyAdmin-continuous/ws/test/selenium/PmaSeleniumTrackingTest.php>:28
     [exec]
     [exec] 66) PMA_SeleniumTrackingTest::testDeactivateTracking
     [exec] Selenium testing not configured.
     [exec]
     [exec] <https://ci.phpmyadmin.net/job/phpMyAdmin-continuous/ws/test/selenium/TestBase.php>:169
     [exec] <https://ci.phpmyadmin.net/job/phpMyAdmin-continuous/ws/test/selenium/PmaSeleniumTrackingTest.php>:28
     [exec]
     [exec] 67) PMA_SeleniumTrackingTest::testDropTracking
     [exec] Selenium testing not configured.
     [exec]
     [exec] <https://ci.phpmyadmin.net/job/phpMyAdmin-continuous/ws/test/selenium/TestBase.php>:169
     [exec] <https://ci.phpmyadmin.net/job/phpMyAdmin-continuous/ws/test/selenium/PmaSeleniumTrackingTest.php>:28
     [exec]
     [exec] 68) PMA_SeleniumTrackingTest::testStructureSnapshot
     [exec] Selenium testing not configured.
     [exec]
     [exec] <https://ci.phpmyadmin.net/job/phpMyAdmin-continuous/ws/test/selenium/TestBase.php>:169
     [exec] <https://ci.phpmyadmin.net/job/phpMyAdmin-continuous/ws/test/selenium/PmaSeleniumTrackingTest.php>:28
     [exec]
     [exec] 69) PMA_SeleniumXSSTest::testQueryTabWithNullValue
     [exec] Selenium testing not configured.
     [exec]
     [exec] <https://ci.phpmyadmin.net/job/phpMyAdmin-continuous/ws/test/selenium/TestBase.php>:169
     [exec]
     [exec] FAILURES!
     [exec] Tests: 2363, Assertions: 6394, Failures: 1, Skipped: 69, Incomplete: 5, Risky: 1.

BUILD FAILED
<https://ci.phpmyadmin.net/job/phpMyAdmin-continuous/ws/build.xml>:33: exec returned: 1

Total time: 19 seconds
Build step 'Invoke Ant' marked build as failure
[CHECKSTYLE] Skipping publisher since build result is FAILURE
[JSLINT] Skipping publisher since build result is FAILURE
[DRY] Collecting duplicate code analysis files...
[DRY] Searching for all files in <https://ci.phpmyadmin.net/job/phpMyAdmin-continuous/ws/> that match the pattern build/logs/pmd-cpd.xml
[DRY] No files found. Configuration error?
[DRY] Computing warning deltas based on reference build #13374
[TASKS] Skipping publisher since build result is FAILURE
[ANALYSIS-COLLECTOR] Computing warning deltas based on reference build #13374
Recording plot data
[xUnit] [INFO] - Starting to record.
[xUnit] [INFO] - Processing PHPUnit-3.x (default)
[xUnit] [INFO] - [PHPUnit-3.x (default)] - 1 test report file(s) were found with the pattern 'build/logs/junit.xml' relative to '<https://ci.phpmyadmin.net/job/phpMyAdmin-continuous/ws/'> for the testing framework 'PHPUnit-3.x (default)'.
[xUnit] [INFO] - Check 'Failed Tests' threshold.
[xUnit] [INFO] - Check 'Skipped Tests' threshold.
[xUnit] [INFO] - Setting the build status to FAILURE
[xUnit] [INFO] - Stopping recording.

_______________________________________________
Developers mailing list
[hidden email]
https://lists.phpmyadmin.net/mailman/listinfo/developers
Reply | Threaded
Open this post in threaded view
|

[phpMyAdmin Developers] Build failed in Jenkins: phpMyAdmin-continuous #13377

Jenkins Daemon
See <https://ci.phpmyadmin.net/job/phpMyAdmin-continuous/13377/display/redirect?page=changes>

Changes:

[Michal Čihař] Increase SQL parser dependency

------------------------------------------
Started by GitHub push by nijel
Started by GitHub push by nijel
[EnvInject] - Loading node environment variables.
Building in workspace <https://ci.phpmyadmin.net/job/phpMyAdmin-continuous/ws/>
 > git rev-parse --is-inside-work-tree # timeout=10
Fetching changes from the remote Git repository
 > git config remote.origin.url https://github.com/phpmyadmin/phpmyadmin.git # timeout=10
Fetching upstream changes from https://github.com/phpmyadmin/phpmyadmin.git
 > git --version # timeout=10
 > git fetch --tags --progress https://github.com/phpmyadmin/phpmyadmin.git +refs/heads/*:refs/remotes/origin/*
 > git rev-parse origin/master^{commit} # timeout=10
Checking out Revision 0e892f30ab828f1c22d10d252ca5fa5d7f250c65 (origin/master)
 > git config core.sparsecheckout # timeout=10
 > git checkout -f 0e892f30ab828f1c22d10d252ca5fa5d7f250c65
 > git rev-list 79f0166c16098ab5f30f0adb86ee0ffe4fb259ff # timeout=10
 > git tag -a -f -m Jenkins Build #13377 jenkins-phpMyAdmin-continuous-13377 # timeout=10
[EnvInject] - Executing scripts and injecting environment variables after the SCM step.
[EnvInject] - Injecting as environment variables the properties content
TESTSUITE_URL=http://ci-live.phpmyadmin.net/phpMyAdmin-continuous/workspace/
TESTSUITE_USER=pmatest
TESTSUITE_DATABASE=pmatest
XTESTSUITE_BROWSERSTACK_USER=michaliha
TESTSUITE_SERVER=localhost

[EnvInject] - Variables injected successfully.
[workspace] $ /bin/sh -xe /tmp/jenkins5818911403932317591.sh
+ composer update --no-interaction
Loading composer repositories with package information
Updating dependencies (including require-dev)
Your requirements could not be resolved to an installable set of packages.

  Problem 1
    - The requested package phpmyadmin/sql-parser ^4.1.10 exists as phpmyadmin/sql-parser[dev-master, dev-motranslator, v1.0.0, v2.0.0, v2.0.1, v2.0.2, v2.0.3, v2.1.0, v2.1.1, v2.1.2, v2.1.3, v3.0.0, v3.0.1, v3.0.2, v3.0.3, v3.0.4, v3.0.5, v3.0.6, v3.0.7, v3.0.8, v3.1.0, v3.2.0, v3.3.0, v3.3.1, v3.4.0, v3.4.1, v3.4.10, v3.4.11, v3.4.12, v3.4.13, v3.4.14, v3.4.15, v3.4.16, v3.4.17, v3.4.2, v3.4.3, v3.4.4, v3.4.5, v3.4.6, v3.4.7, v3.4.8, v3.4.9, v4.0.0, v4.0.1, v4.1.0, v4.1.1, v4.1.2, v4.1.3, v4.1.4, v4.1.5, v4.1.6, v4.1.7, v4.1.8, v4.1.9] but these are rejected by your constraint.

Build step 'Execute shell' marked build as failure
[CHECKSTYLE] Skipping publisher since build result is FAILURE
[JSLINT] Skipping publisher since build result is FAILURE
[DRY] Collecting duplicate code analysis files...
[DRY] Searching for all files in <https://ci.phpmyadmin.net/job/phpMyAdmin-continuous/ws/> that match the pattern build/logs/pmd-cpd.xml
[DRY] No files found. Configuration error?
[DRY] Computing warning deltas based on reference build #13374
[TASKS] Skipping publisher since build result is FAILURE
[ANALYSIS-COLLECTOR] Computing warning deltas based on reference build #13374
Recording plot data
[xUnit] [INFO] - Starting to record.
[xUnit] [INFO] - Processing PHPUnit-3.x (default)
[xUnit] [INFO] - [PHPUnit-3.x (default)] - 1 test report file(s) were found with the pattern 'build/logs/junit.xml' relative to '<https://ci.phpmyadmin.net/job/phpMyAdmin-continuous/ws/'> for the testing framework 'PHPUnit-3.x (default)'.
[xUnit] [ERROR] - Test reports were found but not all of them are new. Did all the tests run?
  * <https://ci.phpmyadmin.net/job/phpMyAdmin-continuous/ws/build/logs/junit.xml> is 6 min 4 sec old

[xUnit] [INFO] - Failing BUILD.
[xUnit] [INFO] - There are errors when processing test results.
[xUnit] [INFO] - Skipping tests recording.
[xUnit] [INFO] - Stop build.

_______________________________________________
Developers mailing list
[hidden email]
https://lists.phpmyadmin.net/mailman/listinfo/developers
Reply | Threaded
Open this post in threaded view
|

[phpMyAdmin Developers] Build failed in Jenkins: phpMyAdmin-continuous #13378

Jenkins Daemon
See <https://ci.phpmyadmin.net/job/phpMyAdmin-continuous/13378/display/redirect?page=changes>

Changes:

[Michal Čihař] Adjust tracker tests to new export code

------------------------------------------
Started by GitHub push by nijel
Started by GitHub push by nijel
[EnvInject] - Loading node environment variables.
Building in workspace <https://ci.phpmyadmin.net/job/phpMyAdmin-continuous/ws/>
 > git rev-parse --is-inside-work-tree # timeout=10
Fetching changes from the remote Git repository
 > git config remote.origin.url https://github.com/phpmyadmin/phpmyadmin.git # timeout=10
Fetching upstream changes from https://github.com/phpmyadmin/phpmyadmin.git
 > git --version # timeout=10
 > git fetch --tags --progress https://github.com/phpmyadmin/phpmyadmin.git +refs/heads/*:refs/remotes/origin/*
 > git rev-parse origin/master^{commit} # timeout=10
Checking out Revision f5c2c5419f0cd2c893ab8e66fea86b79e235278a (origin/master)
 > git config core.sparsecheckout # timeout=10
 > git checkout -f f5c2c5419f0cd2c893ab8e66fea86b79e235278a
 > git rev-list 0e892f30ab828f1c22d10d252ca5fa5d7f250c65 # timeout=10
 > git tag -a -f -m Jenkins Build #13378 jenkins-phpMyAdmin-continuous-13378 # timeout=10
[EnvInject] - Executing scripts and injecting environment variables after the SCM step.
[EnvInject] - Injecting as environment variables the properties content
TESTSUITE_URL=http://ci-live.phpmyadmin.net/phpMyAdmin-continuous/workspace/
TESTSUITE_USER=pmatest
TESTSUITE_DATABASE=pmatest
XTESTSUITE_BROWSERSTACK_USER=michaliha
TESTSUITE_SERVER=localhost

[EnvInject] - Variables injected successfully.
[workspace] $ /bin/sh -xe /tmp/jenkins2595513152408734296.sh
+ composer update --no-interaction
Loading composer repositories with package information
Updating dependencies (including require-dev)
Your requirements could not be resolved to an installable set of packages.

  Problem 1
    - The requested package phpmyadmin/sql-parser ^4.1.10 exists as phpmyadmin/sql-parser[dev-master, dev-motranslator, v1.0.0, v2.0.0, v2.0.1, v2.0.2, v2.0.3, v2.1.0, v2.1.1, v2.1.2, v2.1.3, v3.0.0, v3.0.1, v3.0.2, v3.0.3, v3.0.4, v3.0.5, v3.0.6, v3.0.7, v3.0.8, v3.1.0, v3.2.0, v3.3.0, v3.3.1, v3.4.0, v3.4.1, v3.4.10, v3.4.11, v3.4.12, v3.4.13, v3.4.14, v3.4.15, v3.4.16, v3.4.17, v3.4.2, v3.4.3, v3.4.4, v3.4.5, v3.4.6, v3.4.7, v3.4.8, v3.4.9, v4.0.0, v4.0.1, v4.1.0, v4.1.1, v4.1.2, v4.1.3, v4.1.4, v4.1.5, v4.1.6, v4.1.7, v4.1.8, v4.1.9] but these are rejected by your constraint.

Build step 'Execute shell' marked build as failure
[CHECKSTYLE] Skipping publisher since build result is FAILURE
[JSLINT] Skipping publisher since build result is FAILURE
[DRY] Collecting duplicate code analysis files...
[DRY] Searching for all files in <https://ci.phpmyadmin.net/job/phpMyAdmin-continuous/ws/> that match the pattern build/logs/pmd-cpd.xml
[DRY] No files found. Configuration error?
[DRY] Computing warning deltas based on reference build #13374
[TASKS] Skipping publisher since build result is FAILURE
[ANALYSIS-COLLECTOR] Computing warning deltas based on reference build #13374
Recording plot data
[xUnit] [INFO] - Starting to record.
[xUnit] [INFO] - Processing PHPUnit-3.x (default)
[xUnit] [INFO] - [PHPUnit-3.x (default)] - 1 test report file(s) were found with the pattern 'build/logs/junit.xml' relative to '<https://ci.phpmyadmin.net/job/phpMyAdmin-continuous/ws/'> for the testing framework 'PHPUnit-3.x (default)'.
[xUnit] [ERROR] - Test reports were found but not all of them are new. Did all the tests run?
  * <https://ci.phpmyadmin.net/job/phpMyAdmin-continuous/ws/build/logs/junit.xml> is 9 min 44 sec old

[xUnit] [INFO] - Failing BUILD.
[xUnit] [INFO] - There are errors when processing test results.
[xUnit] [INFO] - Skipping tests recording.
[xUnit] [INFO] - Stop build.

_______________________________________________
Developers mailing list
[hidden email]
https://lists.phpmyadmin.net/mailman/listinfo/developers