[phpMyAdmin Developers] Build failed in Jenkins: phpMyAdmin-continuous #12986

classic Classic list List threaded Threaded
2 messages Options
Reply | Threaded
Open this post in threaded view
|

[phpMyAdmin Developers] Build failed in Jenkins: phpMyAdmin-continuous #12986

Jenkins Daemon
See <https://ci.phpmyadmin.net/job/phpMyAdmin-continuous/12986/display/redirect?page=changes>

Changes:

[madhura.cj] Fix #13282 Default theme does not load

------------------------------------------
Started by GitHub push by madhuracj
[EnvInject] - Loading node environment variables.
Building in workspace <https://ci.phpmyadmin.net/job/phpMyAdmin-continuous/ws/>
 > git rev-parse --is-inside-work-tree # timeout=10
Fetching changes from the remote Git repository
 > git config remote.origin.url https://github.com/phpmyadmin/phpmyadmin.git # timeout=10
Fetching upstream changes from https://github.com/phpmyadmin/phpmyadmin.git
 > git --version # timeout=10
 > git fetch --tags --progress https://github.com/phpmyadmin/phpmyadmin.git +refs/heads/*:refs/remotes/origin/*
 > git rev-parse origin/master^{commit} # timeout=10
Checking out Revision 26403c8447187d67595032dd75e6ac9f2f2c76af (origin/master)
 > git config core.sparsecheckout # timeout=10
 > git checkout -f 26403c8447187d67595032dd75e6ac9f2f2c76af
 > git rev-list 469a7bc5a32d29fcdf7f6806fd20aac708833181 # timeout=10
 > git tag -a -f -m Jenkins Build #12986 jenkins-phpMyAdmin-continuous-12986 # timeout=10
[EnvInject] - Executing scripts and injecting environment variables after the SCM step.
[EnvInject] - Injecting as environment variables the properties content
TESTSUITE_URL=http://ci-live.phpmyadmin.net/phpMyAdmin-continuous/workspace/
TESTSUITE_USER=pmatest
TESTSUITE_DATABASE=pmatest
XTESTSUITE_BROWSERSTACK_USER=michaliha
TESTSUITE_SERVER=localhost

[EnvInject] - Variables injected successfully.
[workspace] $ /bin/sh -xe /tmp/jenkins4239796249764858340.sh
+ composer update --no-interaction
Loading composer repositories with package information
Updating dependencies (including require-dev)
Nothing to install or update
Package guzzle/guzzle is abandoned, you should avoid using it. Use guzzlehttp/guzzle instead.
Generating autoload files
[workspace] $ ant ******** ******** clean locales phpunit-nocoverage phpcpd phpcs phploc jshint jshint-checkstyle
Unable to locate tools.jar. Expected to find it in /usr/lib/jvm/java-8-openjdk-amd64/lib/tools.jar
Buildfile: <https://ci.phpmyadmin.net/job/phpMyAdmin-continuous/ws/build.xml>

clean:
   [delete] Deleting directory <https://ci.phpmyadmin.net/job/phpMyAdmin-continuous/ws/build/api>
   [delete] Deleting directory <https://ci.phpmyadmin.net/job/phpMyAdmin-continuous/ws/build/code-browser>
   [delete] Deleting directory <https://ci.phpmyadmin.net/job/phpMyAdmin-continuous/ws/build/coverage>
   [delete] Deleting directory <https://ci.phpmyadmin.net/job/phpMyAdmin-continuous/ws/build/logs>
   [delete] Deleting directory <https://ci.phpmyadmin.net/job/phpMyAdmin-continuous/ws/build/pdepend>
    [mkdir] Created dir: <https://ci.phpmyadmin.net/job/phpMyAdmin-continuous/ws/build/api>
    [mkdir] Created dir: <https://ci.phpmyadmin.net/job/phpMyAdmin-continuous/ws/build/code-browser>
    [mkdir] Created dir: <https://ci.phpmyadmin.net/job/phpMyAdmin-continuous/ws/build/coverage>
    [mkdir] Created dir: <https://ci.phpmyadmin.net/job/phpMyAdmin-continuous/ws/build/logs>
    [mkdir] Created dir: <https://ci.phpmyadmin.net/job/phpMyAdmin-continuous/ws/build/pdepend>

locales:

phpunit-nocoverage:
     [exec] PHP Notice:  Undefined index: PMA_Config in <https://ci.phpmyadmin.net/job/phpMyAdmin-continuous/ws/libraries/Theme.php> on line 121
     [exec] PHP Fatal error:  Uncaught Error: Call to a member function get() on null in <https://ci.phpmyadmin.net/job/phpMyAdmin-continuous/ws/libraries/Theme.php>:121
     [exec] Stack trace:
     [exec] #0 <https://ci.phpmyadmin.net/job/phpMyAdmin-continuous/ws/libraries/Theme.php(150)>: PMA\libraries\Theme->loadInfo()
     [exec] #1 <https://ci.phpmyadmin.net/job/phpMyAdmin-continuous/ws/test/bootstrap-dist.php(91)>: PMA\libraries\Theme::load('./themes/pmahom...')
     [exec] #2 <https://ci.phpmyadmin.net/job/phpMyAdmin-continuous/ws/vendor/phpunit/phpunit/src/Util/Fileloader.php(56)>: include_once('/var/lib/jenkin...')
     [exec] #3 <https://ci.phpmyadmin.net/job/phpMyAdmin-continuous/ws/vendor/phpunit/phpunit/src/Util/Fileloader.php(38)>: PHPUnit_Util_Fileloader::load('/var/lib/jenkin...')
     [exec] #4 <https://ci.phpmyadmin.net/job/phpMyAdmin-continuous/ws/vendor/phpunit/phpunit/src/TextUI/Command.php(779)>: PHPUnit_Util_Fileloader::checkAndLoad('/var/lib/jenkin...')
     [exec] #5 <https://ci.phpmyadmin.net/job/phpMyAdmin-continuous/ws/vendor/phpunit/phpunit/src/TextUI/Command.php(598)>: PHPUnit_TextUI_Command->handleBootstrap('/ in <https://ci.phpmyadmin.net/job/phpMyAdmin-continuous/ws/libraries/Theme.php> on line 121

BUILD FAILED
<https://ci.phpmyadmin.net/job/phpMyAdmin-continuous/ws/build.xml>:33: exec returned: 255

Total time: 8 seconds
Build step 'Invoke Ant' marked build as failure
[CHECKSTYLE] Skipping publisher since build result is FAILURE
[JSLINT] Skipping publisher since build result is FAILURE
[DRY] Collecting duplicate code analysis files...
[DRY] Searching for all files in <https://ci.phpmyadmin.net/job/phpMyAdmin-continuous/ws/> that match the pattern build/logs/pmd-cpd.xml
[DRY] No files found. Configuration error?
[DRY] Computing warning deltas based on reference build #12985
[TASKS] Skipping publisher since build result is FAILURE
[ANALYSIS-COLLECTOR] Computing warning deltas based on reference build #12985
Recording plot data
[xUnit] [INFO] - Starting to record.
[xUnit] [INFO] - Processing PHPUnit-3.x (default)
[xUnit] [INFO] - [PHPUnit-3.x (default)] - No test report file(s) were found with the pattern 'build/logs/junit.xml' relative to '<https://ci.phpmyadmin.net/job/phpMyAdmin-continuous/ws/'> for the testing framework 'PHPUnit-3.x (default)'.  Did you enter a pattern relative to the correct directory?  Did you generate the result report(s) for 'PHPUnit-3.x (default)'?
[xUnit] [ERROR] - No test reports found for the metric 'PHPUnit' with the resolved pattern 'build/logs/junit.xml'. Configuration error?.
[xUnit] [INFO] - Failing BUILD.
[xUnit] [INFO] - There are errors when processing test results.
[xUnit] [INFO] - Skipping tests recording.
[xUnit] [INFO] - Stop build.

_______________________________________________
Developers mailing list
[hidden email]
https://lists.phpmyadmin.net/mailman/listinfo/developers
Reply | Threaded
Open this post in threaded view
|

[phpMyAdmin Developers] Build failed in Jenkins: phpMyAdmin-continuous #12987

Jenkins Daemon
See <https://ci.phpmyadmin.net/job/phpMyAdmin-continuous/12987/display/redirect?page=changes>

Changes:

[weblate] Translated using Weblate (Belarusian)

[weblate] Translated using Weblate (Interlingua)

------------------------------------------
Started by GitHub push by weblate
[EnvInject] - Loading node environment variables.
Building in workspace <https://ci.phpmyadmin.net/job/phpMyAdmin-continuous/ws/>
 > git rev-parse --is-inside-work-tree # timeout=10
Fetching changes from the remote Git repository
 > git config remote.origin.url https://github.com/phpmyadmin/phpmyadmin.git # timeout=10
Fetching upstream changes from https://github.com/phpmyadmin/phpmyadmin.git
 > git --version # timeout=10
 > git fetch --tags --progress https://github.com/phpmyadmin/phpmyadmin.git +refs/heads/*:refs/remotes/origin/*
 > git rev-parse origin/master^{commit} # timeout=10
Checking out Revision dda04abc46585b5235b6cf3cdcc7ff8cf72b45b9 (origin/master)
 > git config core.sparsecheckout # timeout=10
 > git checkout -f dda04abc46585b5235b6cf3cdcc7ff8cf72b45b9
 > git rev-list 26403c8447187d67595032dd75e6ac9f2f2c76af # timeout=10
 > git tag -a -f -m Jenkins Build #12987 jenkins-phpMyAdmin-continuous-12987 # timeout=10
[EnvInject] - Executing scripts and injecting environment variables after the SCM step.
[EnvInject] - Injecting as environment variables the properties content
TESTSUITE_URL=http://ci-live.phpmyadmin.net/phpMyAdmin-continuous/workspace/
TESTSUITE_USER=pmatest
TESTSUITE_DATABASE=pmatest
XTESTSUITE_BROWSERSTACK_USER=michaliha
TESTSUITE_SERVER=localhost

[EnvInject] - Variables injected successfully.
[workspace] $ /bin/sh -xe /tmp/jenkins180610106563916582.sh
+ composer update --no-interaction
Loading composer repositories with package information
Updating dependencies (including require-dev)
Nothing to install or update
Package guzzle/guzzle is abandoned, you should avoid using it. Use guzzlehttp/guzzle instead.
Generating autoload files
[workspace] $ ant ******** ******** clean locales phpunit-nocoverage phpcpd phpcs phploc jshint jshint-checkstyle
Unable to locate tools.jar. Expected to find it in /usr/lib/jvm/java-8-openjdk-amd64/lib/tools.jar
Buildfile: <https://ci.phpmyadmin.net/job/phpMyAdmin-continuous/ws/build.xml>

clean:
   [delete] Deleting directory <https://ci.phpmyadmin.net/job/phpMyAdmin-continuous/ws/build/api>
   [delete] Deleting directory <https://ci.phpmyadmin.net/job/phpMyAdmin-continuous/ws/build/code-browser>
   [delete] Deleting directory <https://ci.phpmyadmin.net/job/phpMyAdmin-continuous/ws/build/coverage>
   [delete] Deleting directory <https://ci.phpmyadmin.net/job/phpMyAdmin-continuous/ws/build/logs>
   [delete] Deleting directory <https://ci.phpmyadmin.net/job/phpMyAdmin-continuous/ws/build/pdepend>
    [mkdir] Created dir: <https://ci.phpmyadmin.net/job/phpMyAdmin-continuous/ws/build/api>
    [mkdir] Created dir: <https://ci.phpmyadmin.net/job/phpMyAdmin-continuous/ws/build/code-browser>
    [mkdir] Created dir: <https://ci.phpmyadmin.net/job/phpMyAdmin-continuous/ws/build/coverage>
    [mkdir] Created dir: <https://ci.phpmyadmin.net/job/phpMyAdmin-continuous/ws/build/logs>
    [mkdir] Created dir: <https://ci.phpmyadmin.net/job/phpMyAdmin-continuous/ws/build/pdepend>

locales:

phpunit-nocoverage:
     [exec] PHP Notice:  Undefined index: PMA_Config in <https://ci.phpmyadmin.net/job/phpMyAdmin-continuous/ws/libraries/Theme.php> on line 121
     [exec] PHP Fatal error:  Uncaught Error: Call to a member function get() on null in <https://ci.phpmyadmin.net/job/phpMyAdmin-continuous/ws/libraries/Theme.php>:121
     [exec] Stack trace:
     [exec] #0 <https://ci.phpmyadmin.net/job/phpMyAdmin-continuous/ws/libraries/Theme.php(150)>: PMA\libraries\Theme->loadInfo()
     [exec] #1 <https://ci.phpmyadmin.net/job/phpMyAdmin-continuous/ws/test/bootstrap-dist.php(91)>: PMA\libraries\Theme::load('./themes/pmahom...')
     [exec] #2 <https://ci.phpmyadmin.net/job/phpMyAdmin-continuous/ws/vendor/phpunit/phpunit/src/Util/Fileloader.php(56)>: include_once('/var/lib/jenkin...')
     [exec] #3 <https://ci.phpmyadmin.net/job/phpMyAdmin-continuous/ws/vendor/phpunit/phpunit/src/Util/Fileloader.php(38)>: PHPUnit_Util_Fileloader::load('/var/lib/jenkin...')
     [exec] #4 <https://ci.phpmyadmin.net/job/phpMyAdmin-continuous/ws/vendor/phpunit/phpunit/src/TextUI/Command.php(779)>: PHPUnit_Util_Fileloader::checkAndLoad('/var/lib/jenkin...')
     [exec] #5 <https://ci.phpmyadmin.net/job/phpMyAdmin-continuous/ws/vendor/phpunit/phpunit/src/TextUI/Command.php(598)>: PHPUnit_TextUI_Command->handleBootstrap('/ in <https://ci.phpmyadmin.net/job/phpMyAdmin-continuous/ws/libraries/Theme.php> on line 121

BUILD FAILED
<https://ci.phpmyadmin.net/job/phpMyAdmin-continuous/ws/build.xml>:33: exec returned: 255

Total time: 8 seconds
Build step 'Invoke Ant' marked build as failure
[CHECKSTYLE] Skipping publisher since build result is FAILURE
[JSLINT] Skipping publisher since build result is FAILURE
[DRY] Collecting duplicate code analysis files...
[DRY] Searching for all files in <https://ci.phpmyadmin.net/job/phpMyAdmin-continuous/ws/> that match the pattern build/logs/pmd-cpd.xml
[DRY] No files found. Configuration error?
[DRY] Computing warning deltas based on reference build #12985
[TASKS] Skipping publisher since build result is FAILURE
[ANALYSIS-COLLECTOR] Computing warning deltas based on reference build #12985
Recording plot data
[xUnit] [INFO] - Starting to record.
[xUnit] [INFO] - Processing PHPUnit-3.x (default)
[xUnit] [INFO] - [PHPUnit-3.x (default)] - No test report file(s) were found with the pattern 'build/logs/junit.xml' relative to '<https://ci.phpmyadmin.net/job/phpMyAdmin-continuous/ws/'> for the testing framework 'PHPUnit-3.x (default)'.  Did you enter a pattern relative to the correct directory?  Did you generate the result report(s) for 'PHPUnit-3.x (default)'?
[xUnit] [ERROR] - No test reports found for the metric 'PHPUnit' with the resolved pattern 'build/logs/junit.xml'. Configuration error?.
[xUnit] [INFO] - Failing BUILD.
[xUnit] [INFO] - There are errors when processing test results.
[xUnit] [INFO] - Skipping tests recording.
[xUnit] [INFO] - Stop build.

_______________________________________________
Developers mailing list
[hidden email]
https://lists.phpmyadmin.net/mailman/listinfo/developers