[phpMyAdmin Developers] Build failed in Jenkins: phpMyAdmin-continuous #12931

classic Classic list List threaded Threaded
1 message Options
Reply | Threaded
Open this post in threaded view
|

[phpMyAdmin Developers] Build failed in Jenkins: phpMyAdmin-continuous #12931

Jenkins Daemon
See <https://ci.phpmyadmin.net/job/phpMyAdmin-continuous/12931/changes>

Changes:

[Michal Čihař] Fallback to disabled cache in case template loading fails

[Michal Čihař] Pass false as cache to Twig

------------------------------------------
[...truncated 68.20 KB...]
     [exec] <https://ci.phpmyadmin.net/job/phpMyAdmin-continuous/ws/test/selenium/TestBase.php>:168
     [exec] <https://ci.phpmyadmin.net/job/phpMyAdmin-continuous/ws/test/selenium/PmaSeleniumExportTest.php>:28
     [exec]
     [exec] 37) PMA_SeleniumExportTest::testServerImport with data set #2 ('JSON', array('[{"id":"1","val":"2"}]'))
     [exec] Selenium testing not configured.
     [exec]
     [exec] <https://ci.phpmyadmin.net/job/phpMyAdmin-continuous/ws/test/selenium/TestBase.php>:168
     [exec] <https://ci.phpmyadmin.net/job/phpMyAdmin-continuous/ws/test/selenium/PmaSeleniumExportTest.php>:28
     [exec]
     [exec] 38) PMA_SeleniumExportTest::testDbExport with data set #0 ('CSV', array('"1","2"'))
     [exec] Selenium testing not configured.
     [exec]
     [exec] <https://ci.phpmyadmin.net/job/phpMyAdmin-continuous/ws/test/selenium/TestBase.php>:168
     [exec] <https://ci.phpmyadmin.net/job/phpMyAdmin-continuous/ws/test/selenium/PmaSeleniumExportTest.php>:28
     [exec]
     [exec] 39) PMA_SeleniumExportTest::testDbExport with data set #1 ('SQL', array('CREATE TABLE IF NOT EXISTS `t...table`', 'INSERT INTO `test_table` (`id...VALUES', '(1, 2);'))
     [exec] Selenium testing not configured.
     [exec]
     [exec] <https://ci.phpmyadmin.net/job/phpMyAdmin-continuous/ws/test/selenium/TestBase.php>:168
     [exec] <https://ci.phpmyadmin.net/job/phpMyAdmin-continuous/ws/test/selenium/PmaSeleniumExportTest.php>:28
     [exec]
     [exec] 40) PMA_SeleniumExportTest::testDbExport with data set #2 ('JSON', array('[{"id":"1","val":"2"}]'))
     [exec] Selenium testing not configured.
     [exec]
     [exec] <https://ci.phpmyadmin.net/job/phpMyAdmin-continuous/ws/test/selenium/TestBase.php>:168
     [exec] <https://ci.phpmyadmin.net/job/phpMyAdmin-continuous/ws/test/selenium/PmaSeleniumExportTest.php>:28
     [exec]
     [exec] 41) PMA_SeleniumExportTest::testTableExport with data set #0 ('CSV', array('"1","2"'))
     [exec] Selenium testing not configured.
     [exec]
     [exec] <https://ci.phpmyadmin.net/job/phpMyAdmin-continuous/ws/test/selenium/TestBase.php>:168
     [exec] <https://ci.phpmyadmin.net/job/phpMyAdmin-continuous/ws/test/selenium/PmaSeleniumExportTest.php>:28
     [exec]
     [exec] 42) PMA_SeleniumExportTest::testTableExport with data set #1 ('SQL', array('CREATE TABLE IF NOT EXISTS `t...table`', 'INSERT INTO `test_table` (`id...VALUES', '(1, 2);'))
     [exec] Selenium testing not configured.
     [exec]
     [exec] <https://ci.phpmyadmin.net/job/phpMyAdmin-continuous/ws/test/selenium/TestBase.php>:168
     [exec] <https://ci.phpmyadmin.net/job/phpMyAdmin-continuous/ws/test/selenium/PmaSeleniumExportTest.php>:28
     [exec]
     [exec] 43) PMA_SeleniumExportTest::testTableExport with data set #2 ('JSON', array('[{"id":"1","val":"2"}]'))
     [exec] Selenium testing not configured.
     [exec]
     [exec] <https://ci.phpmyadmin.net/job/phpMyAdmin-continuous/ws/test/selenium/TestBase.php>:168
     [exec] <https://ci.phpmyadmin.net/job/phpMyAdmin-continuous/ws/test/selenium/PmaSeleniumExportTest.php>:28
     [exec]
     [exec] 44) PMA_SeleniumImportTest::testServerImport
     [exec] Selenium testing not configured.
     [exec]
     [exec] <https://ci.phpmyadmin.net/job/phpMyAdmin-continuous/ws/test/selenium/TestBase.php>:168
     [exec]
     [exec] 45) PMA_SeleniumImportTest::testDbImport
     [exec] Selenium testing not configured.
     [exec]
     [exec] <https://ci.phpmyadmin.net/job/phpMyAdmin-continuous/ws/test/selenium/TestBase.php>:168
     [exec]
     [exec] 46) PMA_SeleniumImportTest::testTableImport
     [exec] Selenium testing not configured.
     [exec]
     [exec] <https://ci.phpmyadmin.net/job/phpMyAdmin-continuous/ws/test/selenium/TestBase.php>:168
     [exec]
     [exec] 47) PMA_SeleniumLoginTest::testSuccessfulLogin
     [exec] Selenium testing not configured.
     [exec]
     [exec] <https://ci.phpmyadmin.net/job/phpMyAdmin-continuous/ws/test/selenium/TestBase.php>:168
     [exec]
     [exec] 48) PMA_SeleniumLoginTest::testLoginWithWrongPassword
     [exec] Selenium testing not configured.
     [exec]
     [exec] <https://ci.phpmyadmin.net/job/phpMyAdmin-continuous/ws/test/selenium/TestBase.php>:168
     [exec]
     [exec] 49) PMA_SeleniumNormalizationTest::testNormalizationTo1NF
     [exec] Selenium testing not configured.
     [exec]
     [exec] <https://ci.phpmyadmin.net/job/phpMyAdmin-continuous/ws/test/selenium/TestBase.php>:168
     [exec] <https://ci.phpmyadmin.net/job/phpMyAdmin-continuous/ws/test/selenium/PmaSeleniumNormalizationTest.php>:28
     [exec]
     [exec] 50) PMA_SeleniumPrivilegesTest::testChangePassword
     [exec] Selenium testing not configured.
     [exec]
     [exec] <https://ci.phpmyadmin.net/job/phpMyAdmin-continuous/ws/test/selenium/TestBase.php>:168
     [exec]
     [exec] 51) PMA_SeleniumSettingsTest::testHideDatabase
     [exec] Selenium testing not configured.
     [exec]
     [exec] <https://ci.phpmyadmin.net/job/phpMyAdmin-continuous/ws/test/selenium/TestBase.php>:168
     [exec]
     [exec] 52) PMA_SeleniumSettingsTest::testSettingsTabsAreDisplayed
     [exec] Selenium testing not configured.
     [exec]
     [exec] <https://ci.phpmyadmin.net/job/phpMyAdmin-continuous/ws/test/selenium/TestBase.php>:168
     [exec]
     [exec] 53) PMA_SeleniumSettingsTest::testHideLogo
     [exec] Selenium testing not configured.
     [exec]
     [exec] <https://ci.phpmyadmin.net/job/phpMyAdmin-continuous/ws/test/selenium/TestBase.php>:168
     [exec]
     [exec] 54) PMA_SeleniumTableBrowseTest::testSortRecords
     [exec] Selenium testing not configured.
     [exec]
     [exec] <https://ci.phpmyadmin.net/job/phpMyAdmin-continuous/ws/test/selenium/TestBase.php>:168
     [exec] <https://ci.phpmyadmin.net/job/phpMyAdmin-continuous/ws/test/selenium/PmaSeleniumTableBrowseTest.php>:28
     [exec]
     [exec] 55) PMA_SeleniumTableBrowseTest::testChangeRecords
     [exec] Selenium testing not configured.
     [exec]
     [exec] <https://ci.phpmyadmin.net/job/phpMyAdmin-continuous/ws/test/selenium/TestBase.php>:168
     [exec] <https://ci.phpmyadmin.net/job/phpMyAdmin-continuous/ws/test/selenium/PmaSeleniumTableBrowseTest.php>:28
     [exec]
     [exec] 56) PMA_SeleniumTableBrowseTest::testChangeRecordsByDoubleClick
     [exec] Selenium testing not configured.
     [exec]
     [exec] <https://ci.phpmyadmin.net/job/phpMyAdmin-continuous/ws/test/selenium/TestBase.php>:168
     [exec] <https://ci.phpmyadmin.net/job/phpMyAdmin-continuous/ws/test/selenium/PmaSeleniumTableBrowseTest.php>:28
     [exec]
     [exec] 57) PMA_SeleniumTableBrowseTest::testCopyRecords
     [exec] Selenium testing not configured.
     [exec]
     [exec] <https://ci.phpmyadmin.net/job/phpMyAdmin-continuous/ws/test/selenium/TestBase.php>:168
     [exec] <https://ci.phpmyadmin.net/job/phpMyAdmin-continuous/ws/test/selenium/PmaSeleniumTableBrowseTest.php>:28
     [exec]
     [exec] 58) PMA_SeleniumTableBrowseTest::testSearchRecords
     [exec] Selenium testing not configured.
     [exec]
     [exec] <https://ci.phpmyadmin.net/job/phpMyAdmin-continuous/ws/test/selenium/TestBase.php>:168
     [exec] <https://ci.phpmyadmin.net/job/phpMyAdmin-continuous/ws/test/selenium/PmaSeleniumTableBrowseTest.php>:28
     [exec]
     [exec] 59) PMA_SeleniumTableBrowseTest::testDeleteRecords
     [exec] Selenium testing not configured.
     [exec]
     [exec] <https://ci.phpmyadmin.net/job/phpMyAdmin-continuous/ws/test/selenium/TestBase.php>:168
     [exec] <https://ci.phpmyadmin.net/job/phpMyAdmin-continuous/ws/test/selenium/PmaSeleniumTableBrowseTest.php>:28
     [exec]
     [exec] 60) PMA_SeleniumTableCreateTest::testCreateTable
     [exec] Selenium testing not configured.
     [exec]
     [exec] <https://ci.phpmyadmin.net/job/phpMyAdmin-continuous/ws/test/selenium/TestBase.php>:168
     [exec]
     [exec] 61) PMA_SeleniumTableInsertTest::testAddData
     [exec] Selenium testing not configured.
     [exec]
     [exec] <https://ci.phpmyadmin.net/job/phpMyAdmin-continuous/ws/test/selenium/TestBase.php>:168
     [exec] <https://ci.phpmyadmin.net/job/phpMyAdmin-continuous/ws/test/selenium/PmaSeleniumTableInsertTest.php>:29
     [exec]
     [exec] 62) PMA_SeleniumTableOperationsTest::testChangeTableOrder
     [exec] Selenium testing not configured.
     [exec]
     [exec] <https://ci.phpmyadmin.net/job/phpMyAdmin-continuous/ws/test/selenium/TestBase.php>:168
     [exec] <https://ci.phpmyadmin.net/job/phpMyAdmin-continuous/ws/test/selenium/PmaSeleniumTableOperationsTest.php>:28
     [exec]
     [exec] 63) PMA_SeleniumTableOperationsTest::testMoveTable
     [exec] Selenium testing not configured.
     [exec]
     [exec] <https://ci.phpmyadmin.net/job/phpMyAdmin-continuous/ws/test/selenium/TestBase.php>:168
     [exec] <https://ci.phpmyadmin.net/job/phpMyAdmin-continuous/ws/test/selenium/PmaSeleniumTableOperationsTest.php>:28
     [exec]
     [exec] 64) PMA_SeleniumTableOperationsTest::testRenameTable
     [exec] Selenium testing not configured.
     [exec]
     [exec] <https://ci.phpmyadmin.net/job/phpMyAdmin-continuous/ws/test/selenium/TestBase.php>:168
     [exec] <https://ci.phpmyadmin.net/job/phpMyAdmin-continuous/ws/test/selenium/PmaSeleniumTableOperationsTest.php>:28
     [exec]
     [exec] 65) PMA_SeleniumTableOperationsTest::testCopyTable
     [exec] Selenium testing not configured.
     [exec]
     [exec] <https://ci.phpmyadmin.net/job/phpMyAdmin-continuous/ws/test/selenium/TestBase.php>:168
     [exec] <https://ci.phpmyadmin.net/job/phpMyAdmin-continuous/ws/test/selenium/PmaSeleniumTableOperationsTest.php>:28
     [exec]
     [exec] 66) PMA_SeleniumTableOperationsTest::testTruncateTable
     [exec] Selenium testing not configured.
     [exec]
     [exec] <https://ci.phpmyadmin.net/job/phpMyAdmin-continuous/ws/test/selenium/TestBase.php>:168
     [exec] <https://ci.phpmyadmin.net/job/phpMyAdmin-continuous/ws/test/selenium/PmaSeleniumTableOperationsTest.php>:28
     [exec]
     [exec] 67) PMA_SeleniumTableOperationsTest::testDropTable
     [exec] Selenium testing not configured.
     [exec]
     [exec] <https://ci.phpmyadmin.net/job/phpMyAdmin-continuous/ws/test/selenium/TestBase.php>:168
     [exec] <https://ci.phpmyadmin.net/job/phpMyAdmin-continuous/ws/test/selenium/PmaSeleniumTableOperationsTest.php>:28
     [exec]
     [exec] 68) PMA_SeleniumTableStructureTest::testAddColumn
     [exec] Selenium testing not configured.
     [exec]
     [exec] <https://ci.phpmyadmin.net/job/phpMyAdmin-continuous/ws/test/selenium/TestBase.php>:168
     [exec] <https://ci.phpmyadmin.net/job/phpMyAdmin-continuous/ws/test/selenium/PmaSeleniumTableStructureTest.php>:28
     [exec]
     [exec] 69) PMA_SeleniumTableStructureTest::testChangeColumn
     [exec] Selenium testing not configured.
     [exec]
     [exec] <https://ci.phpmyadmin.net/job/phpMyAdmin-continuous/ws/test/selenium/TestBase.php>:168
     [exec] <https://ci.phpmyadmin.net/job/phpMyAdmin-continuous/ws/test/selenium/PmaSeleniumTableStructureTest.php>:28
     [exec]
     [exec] 70) PMA_SeleniumTableStructureTest::testDropColumns
     [exec] Selenium testing not configured.
     [exec]
     [exec] <https://ci.phpmyadmin.net/job/phpMyAdmin-continuous/ws/test/selenium/TestBase.php>:168
     [exec] <https://ci.phpmyadmin.net/job/phpMyAdmin-continuous/ws/test/selenium/PmaSeleniumTableStructureTest.php>:28
     [exec]
     [exec] 71) PMA_SeleniumTrackingTest::testTrackingData
     [exec] Selenium testing not configured.
     [exec]
     [exec] <https://ci.phpmyadmin.net/job/phpMyAdmin-continuous/ws/test/selenium/TestBase.php>:168
     [exec] <https://ci.phpmyadmin.net/job/phpMyAdmin-continuous/ws/test/selenium/PmaSeleniumTrackingTest.php>:28
     [exec]
     [exec] 72) PMA_SeleniumTrackingTest::testDeactivateTracking
     [exec] Selenium testing not configured.
     [exec]
     [exec] <https://ci.phpmyadmin.net/job/phpMyAdmin-continuous/ws/test/selenium/TestBase.php>:168
     [exec] <https://ci.phpmyadmin.net/job/phpMyAdmin-continuous/ws/test/selenium/PmaSeleniumTrackingTest.php>:28
     [exec]
     [exec] 73) PMA_SeleniumTrackingTest::testDropTracking
     [exec] Selenium testing not configured.
     [exec]
     [exec] <https://ci.phpmyadmin.net/job/phpMyAdmin-continuous/ws/test/selenium/TestBase.php>:168
     [exec] <https://ci.phpmyadmin.net/job/phpMyAdmin-continuous/ws/test/selenium/PmaSeleniumTrackingTest.php>:28
     [exec]
     [exec] 74) PMA_SeleniumTrackingTest::testStructureSnapshot
     [exec] Selenium testing not configured.
     [exec]
     [exec] <https://ci.phpmyadmin.net/job/phpMyAdmin-continuous/ws/test/selenium/TestBase.php>:168
     [exec] <https://ci.phpmyadmin.net/job/phpMyAdmin-continuous/ws/test/selenium/PmaSeleniumTrackingTest.php>:28
     [exec]
     [exec] 75) PMA_SeleniumXSSTest::testQueryTabWithNullValue
     [exec] Selenium testing not configured.
     [exec]
     [exec] <https://ci.phpmyadmin.net/job/phpMyAdmin-continuous/ws/test/selenium/TestBase.php>:168
     [exec]
     [exec] FAILURES!
     [exec] Tests: 2336, Assertions: 5903, Errors: 99, Failures: 1, Skipped: 75, Incomplete: 5, Risky: 1.

BUILD FAILED
<https://ci.phpmyadmin.net/job/phpMyAdmin-continuous/ws/build.xml>:33: exec returned: 2

Total time: 14 seconds
Build step 'Invoke Ant' marked build as failure
[CHECKSTYLE] Skipping publisher since build result is FAILURE
[JSLINT] Skipping publisher since build result is FAILURE
[DRY] Collecting duplicate code analysis files...
[DRY] Finding all files that match the pattern build/logs/pmd-cpd.xml
[DRY] Computing warning deltas based on reference build #12930
[TASKS] Skipping publisher since build result is FAILURE
[ANALYSIS-COLLECTOR] Computing warning deltas based on reference build #12930
Recording plot data
[xUnit] [INFO] - Starting to record.
[xUnit] [INFO] - Processing PHPUnit-3.x (default)
[xUnit] [INFO] - [PHPUnit-3.x (default)] - 1 test report file(s) were found with the pattern 'build/logs/junit.xml' relative to '<https://ci.phpmyadmin.net/job/phpMyAdmin-continuous/ws/'> for the testing framework 'PHPUnit-3.x (default)'.
[xUnit] [INFO] - Check 'Failed Tests' threshold.
[xUnit] [INFO] - Check 'Skipped Tests' threshold.
[xUnit] [INFO] - Setting the build status to FAILURE
[xUnit] [INFO] - Stopping recording.

_______________________________________________
Developers mailing list
[hidden email]
https://lists.phpmyadmin.net/mailman/listinfo/developers