[phpMyAdmin Developers] Build failed in Jenkins: phpMyAdmin-continuous #12890

classic Classic list List threaded Threaded
2 messages Options
Reply | Threaded
Open this post in threaded view
|

[phpMyAdmin Developers] Build failed in Jenkins: phpMyAdmin-continuous #12890

Jenkins Daemon
See <https://ci.phpmyadmin.net/job/phpMyAdmin-continuous/12890/changes>

Changes:

[weblate] Translated using Weblate (Arabic)

[weblate] Translated using Weblate (Dutch)

[weblate] Translated using Weblate (Interlingua)

[weblate] Translated using Weblate (Turkish)

------------------------------------------
Started by GitHub push by weblate
[EnvInject] - Loading node environment variables.
Building in workspace <https://ci.phpmyadmin.net/job/phpMyAdmin-continuous/ws/>
 > git rev-parse --is-inside-work-tree # timeout=10
Fetching changes from the remote Git repository
 > git config remote.origin.url https://github.com/phpmyadmin/phpmyadmin.git # timeout=10
Fetching upstream changes from https://github.com/phpmyadmin/phpmyadmin.git
 > git --version # timeout=10
 > git -c core.askpass=true fetch --tags --progress https://github.com/phpmyadmin/phpmyadmin.git +refs/heads/*:refs/remotes/origin/*
 > git rev-parse origin/master^{commit} # timeout=10
Checking out Revision a97e0cf31aa1f60ca2256ba4bcb64394d6c1ff24 (origin/master)
 > git config core.sparsecheckout # timeout=10
 > git checkout -f a97e0cf31aa1f60ca2256ba4bcb64394d6c1ff24
 > git rev-list 9f07f8645a0873edf04bd5fcfa6348f2751a81cf # timeout=10
 > git tag -a -f -m Jenkins Build #12890 jenkins-phpMyAdmin-continuous-12890 # timeout=10
[EnvInject] - Executing scripts and injecting environment variables after the SCM step.
[EnvInject] - Injecting as environment variables the properties content
TESTSUITE_SERVER=localhost
TESTSUITE_USER=pmatest
TESTSUITE_DATABASE=pmatest
TESTSUITE_URL=http://ci-live.phpmyadmin.net/phpMyAdmin-continuous/workspace/
XTESTSUITE_BROWSERSTACK_USER=michaliha

[EnvInject] - Variables injected successfully.
[workspace] $ /bin/sh -xe /tmp/hudson2866604073871702309.sh
+ composer update --no-interaction
Loading composer repositories with package information
Updating dependencies (including require-dev)
Nothing to install or update
Package guzzle/guzzle is abandoned, you should avoid using it. Use guzzlehttp/guzzle instead.
Generating autoload files
[workspace] $ ant ******** ******** clean locales phpunit-nocoverage phpcpd phpcs phploc jshint jshint-checkstyle
Unable to locate tools.jar. Expected to find it in /usr/lib/jvm/java-8-openjdk-amd64/lib/tools.jar
Buildfile: <https://ci.phpmyadmin.net/job/phpMyAdmin-continuous/ws/build.xml>

clean:
   [delete] Deleting directory <https://ci.phpmyadmin.net/job/phpMyAdmin-continuous/ws/build/api>
   [delete] Deleting directory <https://ci.phpmyadmin.net/job/phpMyAdmin-continuous/ws/build/code-browser>
   [delete] Deleting directory <https://ci.phpmyadmin.net/job/phpMyAdmin-continuous/ws/build/coverage>
   [delete] Deleting directory <https://ci.phpmyadmin.net/job/phpMyAdmin-continuous/ws/build/logs>
   [delete] Deleting directory <https://ci.phpmyadmin.net/job/phpMyAdmin-continuous/ws/build/pdepend>
    [mkdir] Created dir: <https://ci.phpmyadmin.net/job/phpMyAdmin-continuous/ws/build/api>
    [mkdir] Created dir: <https://ci.phpmyadmin.net/job/phpMyAdmin-continuous/ws/build/code-browser>
    [mkdir] Created dir: <https://ci.phpmyadmin.net/job/phpMyAdmin-continuous/ws/build/coverage>
    [mkdir] Created dir: <https://ci.phpmyadmin.net/job/phpMyAdmin-continuous/ws/build/logs>
    [mkdir] Created dir: <https://ci.phpmyadmin.net/job/phpMyAdmin-continuous/ws/build/pdepend>

locales:
     [exec] po/ar.po:24: a format specification for argument 2 doesn't exist in 'msgstr'
     [exec] msgfmt: found 1 fatal error
     [exec] tput: No value for $TERM and no -T specified
     [exec] Error when compiling po/ar.po
     [exec] tput: No value for $TERM and no -T specified

BUILD FAILED
<https://ci.phpmyadmin.net/job/phpMyAdmin-continuous/ws/build.xml>:138: exec returned: 1

Total time: 10 seconds
Build step 'Invoke Ant' marked build as failure
[CHECKSTYLE] Skipping publisher since build result is FAILURE
[JSLINT] Skipping publisher since build result is FAILURE
[DRY] Collecting duplicate code analysis files...
[DRY] Finding all files that match the pattern build/logs/pmd-cpd.xml
[DRY] Computing warning deltas based on reference build #12889
[TASKS] Skipping publisher since build result is FAILURE
[ANALYSIS-COLLECTOR] Computing warning deltas based on reference build #12889
Recording plot data
[xUnit] [INFO] - Starting to record.
[xUnit] [INFO] - Processing PHPUnit-3.x (default)
[xUnit] [INFO] - [PHPUnit-3.x (default)] - No test report file(s) were found with the pattern 'build/logs/junit.xml' relative to '<https://ci.phpmyadmin.net/job/phpMyAdmin-continuous/ws/'> for the testing framework 'PHPUnit-3.x (default)'.  Did you enter a pattern relative to the correct directory?  Did you generate the result report(s) for 'PHPUnit-3.x (default)'?
[xUnit] [ERROR] - No test reports found for the metric 'PHPUnit' with the resolved pattern 'build/logs/junit.xml'. Configuration error?.
[xUnit] [INFO] - Failing BUILD.
[xUnit] [INFO] - There are errors when processing test results.
[xUnit] [INFO] - Skipping tests recording.
[xUnit] [INFO] - Stop build.

_______________________________________________
Developers mailing list
[hidden email]
https://lists.phpmyadmin.net/mailman/listinfo/developers
Reply | Threaded
Open this post in threaded view
|

[phpMyAdmin Developers] Jenkins build is back to normal : phpMyAdmin-continuous #12891

Jenkins Daemon