[phpMyAdmin Developers] Build failed in Jenkins: phpMyAdmin-4.7 #658

classic Classic list List threaded Threaded
1 message Options
Reply | Threaded
Open this post in threaded view
|

[phpMyAdmin Developers] Build failed in Jenkins: phpMyAdmin-4.7 #658

Jenkins Daemon
See <https://ci.phpmyadmin.net/job/phpMyAdmin-4.7/658/display/redirect?page=changes>

Changes:

[Michal Čihař] Update SQL parser to 4.2.3

------------------------------------------
Started by GitHub push by nijel
[EnvInject] - Loading node environment variables.
Building in workspace <https://ci.phpmyadmin.net/job/phpMyAdmin-4.7/ws/>
 > git rev-parse --is-inside-work-tree # timeout=10
Fetching changes from the remote Git repository
 > git config remote.origin.url git://github.com/phpmyadmin/phpmyadmin.git # timeout=10
Fetching upstream changes from git://github.com/phpmyadmin/phpmyadmin.git
 > git --version # timeout=10
 > git fetch --tags --progress git://github.com/phpmyadmin/phpmyadmin.git +refs/heads/*:refs/remotes/origin/*
 > git rev-parse origin/QA_4_7^{commit} # timeout=10
Checking out Revision f5d950da6f7e66d901eac7bb2a7d3297eae2d384 (origin/QA_4_7)
Commit message: "Update SQL parser to 4.2.3"
 > git config core.sparsecheckout # timeout=10
 > git checkout -f f5d950da6f7e66d901eac7bb2a7d3297eae2d384
 > git rev-list 867ed9f8a34174dffd3595830c81e738d7a4673f # timeout=10
[workspace] $ /bin/sh -xe /tmp/jenkins7429466409428683699.sh
+ composer update --no-interaction
Loading composer repositories with package information
Updating dependencies (including require-dev)
Your requirements could not be resolved to an installable set of packages.

  Problem 1
    - The requested package phpmyadmin/sql-parser ^4.2.3 exists as phpmyadmin/sql-parser[dev-master, dev-motranslator, v1.0.0, v2.0.0, v2.0.1, v2.0.2, v2.0.3, v2.1.0, v2.1.1, v2.1.2, v2.1.3, v3.0.0, v3.0.1, v3.0.2, v3.0.3, v3.0.4, v3.0.5, v3.0.6, v3.0.7, v3.0.8, v3.1.0, v3.2.0, v3.3.0, v3.3.1, v3.4.0, v3.4.1, v3.4.10, v3.4.11, v3.4.12, v3.4.13, v3.4.14, v3.4.15, v3.4.16, v3.4.17, v3.4.2, v3.4.3, v3.4.4, v3.4.5, v3.4.6, v3.4.7, v3.4.8, v3.4.9, v4.0.0, v4.0.1, v4.1.0, v4.1.1, v4.1.10, v4.1.2, v4.1.3, v4.1.4, v4.1.5, v4.1.6, v4.1.7, v4.1.8, v4.1.9, v4.2.0, v4.2.1, v4.2.2] but these are rejected by your constraint.

Build step 'Execute shell' marked build as failure
[CHECKSTYLE] Skipping publisher since build result is FAILURE
[JSLINT] Skipping publisher since build result is FAILURE
[PMD] Skipping publisher since build result is FAILURE
[DRY] Collecting duplicate code analysis files...
[DRY] Searching for all files in <https://ci.phpmyadmin.net/job/phpMyAdmin-4.7/ws/> that match the pattern build/logs/pmd-cpd.xml
[DRY] Parsing 1 file in <https://ci.phpmyadmin.net/job/phpMyAdmin-4.7/ws/>
[DRY] Successfully parsed file <https://ci.phpmyadmin.net/job/phpMyAdmin-4.7/ws/build/logs/pmd-cpd.xml> with 12 unique warnings and 0 duplicates.
[DRY] Computing warning deltas based on reference build #657
[TASKS] Skipping publisher since build result is FAILURE
[ANALYSIS-COLLECTOR] Computing warning deltas based on reference build #657
Recording plot data
Publishing Clover coverage report...
Clover xml file does not exist in: <https://ci.phpmyadmin.net/job/phpMyAdmin-4.7/ws/> called: build/logs/clover.xml and will not be copied to: /var/lib/jenkins/jobs/phpMyAdmin-4.7/builds/658/cloverphp/clover.xml
Could not find 'build/coverage/build/logs/clover.xml'.  Did you generate the XML report for Clover?
[xUnit] [INFO] - Starting to record.
[xUnit] [INFO] - Processing PHPUnit-3.x (default)
[xUnit] [INFO] - [PHPUnit-3.x (default)] - 1 test report file(s) were found with the pattern 'build/logs/junit.xml' relative to '<https://ci.phpmyadmin.net/job/phpMyAdmin-4.7/ws/'> for the testing framework 'PHPUnit-3.x (default)'.
[xUnit] [ERROR] - Test reports were found but not all of them are new. Did all the tests run?
  * <https://ci.phpmyadmin.net/job/phpMyAdmin-4.7/ws/build/logs/junit.xml> is 24 min old

[xUnit] [INFO] - Failing BUILD.
[xUnit] [INFO] - There are errors when processing test results.
[xUnit] [INFO] - Skipping tests recording.
[xUnit] [INFO] - Stop build.
[JDepend] JDepend plugin is ready
[JDepend] Found 2513 classes in 201 packages

_______________________________________________
Developers mailing list
[hidden email]
https://lists.phpmyadmin.net/mailman/listinfo/developers