[phpMyAdmin Developers] Build failed in Jenkins: phpMyAdmin-4.7 #551

classic Classic list List threaded Threaded
1 message Options
Reply | Threaded
Open this post in threaded view
|

[phpMyAdmin Developers] Build failed in Jenkins: phpMyAdmin-4.7 #551

Jenkins Daemon
See <https://ci.phpmyadmin.net/job/phpMyAdmin-4.7/551/display/redirect?page=changes>

Changes:

[weblate] Translated using Weblate (Indonesian)

[weblate] Translated using Weblate (Indonesian)

------------------------------------------
Started by GitHub push by weblate
Started by GitHub push by weblate
Started by GitHub push by weblate
[EnvInject] - Loading node environment variables.
Building in workspace <https://ci.phpmyadmin.net/job/phpMyAdmin-4.7/ws/>
 > git rev-parse --is-inside-work-tree # timeout=10
Fetching changes from the remote Git repository
 > git config remote.origin.url git://github.com/phpmyadmin/phpmyadmin.git # timeout=10
Fetching upstream changes from git://github.com/phpmyadmin/phpmyadmin.git
 > git --version # timeout=10
 > git fetch --tags --progress git://github.com/phpmyadmin/phpmyadmin.git +refs/heads/*:refs/remotes/origin/*
 > git rev-parse origin/QA_4_7^{commit} # timeout=10
Checking out Revision 83c6cb221c6b5f850deb0aea36703a79c3ec7c1e (origin/QA_4_7)
Commit message: "Translated using Weblate (Indonesian)"
 > git config core.sparsecheckout # timeout=10
 > git checkout -f 83c6cb221c6b5f850deb0aea36703a79c3ec7c1e
 > git rev-list f38edebb3f0d22838e246d4c6bb293ccd8f67327 # timeout=10
[workspace] $ /bin/sh -xe /tmp/jenkins29671121505087437.sh
+ composer update --no-interaction
Loading composer repositories with package information
Updating dependencies (including require-dev)
Nothing to install or update
Generating autoload files
+ ./scripts/generate-mo --quiet
po/id.po:8378: format specifications in 'msgid_plural' and 'msgstr[0]' for argument 1 are not the same
msgfmt: found 1 fatal error
tput: No value for $TERM and no -T specified
Error when compiling po/id.po
tput: No value for $TERM and no -T specified
Build step 'Execute shell' marked build as failure
[CHECKSTYLE] Skipping publisher since build result is FAILURE
[JSLINT] Skipping publisher since build result is FAILURE
[PMD] Skipping publisher since build result is FAILURE
[DRY] Collecting duplicate code analysis files...
[DRY] Searching for all files in <https://ci.phpmyadmin.net/job/phpMyAdmin-4.7/ws/> that match the pattern build/logs/pmd-cpd.xml
[DRY] Parsing 1 file in <https://ci.phpmyadmin.net/job/phpMyAdmin-4.7/ws/>
[DRY] Successfully parsed file <https://ci.phpmyadmin.net/job/phpMyAdmin-4.7/ws/build/logs/pmd-cpd.xml> with 12 unique warnings and 0 duplicates.
[DRY] Computing warning deltas based on reference build #550
[TASKS] Skipping publisher since build result is FAILURE
[ANALYSIS-COLLECTOR] Computing warning deltas based on reference build #550
Recording plot data
Publishing Clover coverage report...
Clover xml file does not exist in: <https://ci.phpmyadmin.net/job/phpMyAdmin-4.7/ws/> called: build/logs/clover.xml and will not be copied to: /var/lib/jenkins/jobs/phpMyAdmin-4.7/builds/551/cloverphp/clover.xml
Could not find 'build/coverage/build/logs/clover.xml'.  Did you generate the XML report for Clover?
[xUnit] [INFO] - Starting to record.
[xUnit] [INFO] - Processing PHPUnit-3.x (default)
[xUnit] [INFO] - [PHPUnit-3.x (default)] - 1 test report file(s) were found with the pattern 'build/logs/junit.xml' relative to '<https://ci.phpmyadmin.net/job/phpMyAdmin-4.7/ws/'> for the testing framework 'PHPUnit-3.x (default)'.
[xUnit] [ERROR] - Test reports were found but not all of them are new. Did all the tests run?
  * <https://ci.phpmyadmin.net/job/phpMyAdmin-4.7/ws/build/logs/junit.xml> is 20 min old

[xUnit] [INFO] - Failing BUILD.
[xUnit] [INFO] - There are errors when processing test results.
[xUnit] [INFO] - Skipping tests recording.
[xUnit] [INFO] - Stop build.
[JDepend] JDepend plugin is ready
[JDepend] Found 2610 classes in 219 packages

_______________________________________________
Developers mailing list
[hidden email]
https://lists.phpmyadmin.net/mailman/listinfo/developers