[phpMyAdmin Developers] Build failed in Jenkins: phpMyAdmin #2291

classic Classic list List threaded Threaded
1 message Options
Reply | Threaded
Open this post in threaded view
|

[phpMyAdmin Developers] Build failed in Jenkins: phpMyAdmin #2291

Jenkins Daemon
See <https://ci.phpmyadmin.net/job/phpMyAdmin/2291/display/redirect?page=changes>

Changes:

[weblate] Translated using Weblate (Estonian)

[weblate] Translated using Weblate (Italian)

[weblate] Translated using Weblate (Dutch)

[weblate] Translated using Weblate (Dutch)

[weblate] Translated using Weblate (Polish)

[weblate] Translated using Weblate (German)

[weblate] Translated using Weblate (English (United Kingdom))

[weblate] Translated using Weblate (German)

[weblate] Translated using Weblate (Slovenian)

[weblate] Translated using Weblate (Portuguese)

[weblate] Translated using Weblate (Danish)

[weblate] Translated using Weblate (Ukrainian)

[Michal Čihař] Fix undefined variable wihout DB connection

[weblate] Translated using Weblate (Danish)

[Michal Čihař] Add SJIS-win to default list of allowed charsets

[Michal Čihař] Use PHP 7.1 for Selenium tests

[Michal Čihař] Remove sprites from the themes

[Michal Čihař] Fix some redirecting URLs

[weblate] Translated using Weblate (English (United Kingdom))

[mauriciofauth] Make Multi Table Query strings translatable.

[weblate] Translated using Weblate (English (United Kingdom))

[mauriciofauth] Use template for getColumnsHTML

[mauriciofauth] Use template for getFormHTML

[mauriciofauth] Add missing trans tag

[mauriciofauth] Refactor Database/MultiTableQuery to use DI

[mauriciofauth] Move columns template into form template

[mauriciofauth] Refactor getFormHTML method

[mauriciofauth] Move new_column template into form template

[mauriciofauth] Move query results logic into MultiTableQuery class

[weblate] Translated using Weblate (English (United Kingdom))

------------------------------------------
Started by timer
[EnvInject] - Loading node environment variables.
Building in workspace <https://ci.phpmyadmin.net/job/phpMyAdmin/ws/>
 > git rev-parse --is-inside-work-tree # timeout=10
Fetching changes from the remote Git repository
 > git config remote.origin.url https://github.com/phpmyadmin/phpmyadmin.git # timeout=10
Fetching upstream changes from https://github.com/phpmyadmin/phpmyadmin.git
 > git --version # timeout=10
 > git fetch --tags --progress https://github.com/phpmyadmin/phpmyadmin.git +refs/heads/*:refs/remotes/origin/*
 > git rev-parse origin/master^{commit} # timeout=10
Checking out Revision 2da54c8140b55bc9f83a9ef97dd0b4ff56e74bd9 (origin/master)
Commit message: "Merge remote-tracking branch 'origin/master'"
 > git config core.sparsecheckout # timeout=10
 > git checkout -f 2da54c8140b55bc9f83a9ef97dd0b4ff56e74bd9
 > git rev-list 1f98dcf1c2771e8557cd6151795eed8a8ec53456 # timeout=10
[EnvInject] - Executing scripts and injecting environment variables after the SCM step.
[EnvInject] - Injecting as environment variables the properties content
TESTSUITE_URL=http://ci-live.phpmyadmin.net/phpMyAdmin/workspace/
TESTSUITE_USER=pmatest
TESTSUITE_DATABASE=pmatest
XTESTSUITE_BROWSERSTACK_USER=michaliha
TESTSUITE_SERVER=localhost

[EnvInject] - Variables injected successfully.
[workspace] $ /bin/sh -xe /tmp/jenkins7613708526920700832.sh
+ composer update --no-interaction
Loading composer repositories with package information
Updating dependencies (including require-dev)
Package operations: 0 installs, 6 updates, 0 removals
  - Updating symfony/cache (v3.3.11 => v3.3.12): Loading from cache
  - Updating symfony/expression-language (v3.3.11 => v3.3.12): Loading from cache
  - Updating symfony/debug (v3.3.11 => v3.3.12): Loading from cache
  - Updating symfony/console (v3.3.11 => v3.3.12): Loading from cache
  - Updating symfony/yaml (v3.3.11 => v3.3.12): Loading from cache
  - Updating symfony/process (v3.3.11 => v3.3.12): Loading from cache
Writing lock file
Generating autoload files
[workspace] $ ant ******** ******** clean locales phpunit pdepend phpmd phpcpd phpcs phploc jshint jshint-checkstyle lint
Unable to locate tools.jar. Expected to find it in /usr/lib/jvm/java-8-openjdk-amd64/lib/tools.jar
Buildfile: <https://ci.phpmyadmin.net/job/phpMyAdmin/ws/build.xml>

clean:
   [delete] Deleting directory <https://ci.phpmyadmin.net/job/phpMyAdmin/ws/build/api>
   [delete] Deleting directory <https://ci.phpmyadmin.net/job/phpMyAdmin/ws/build/code-browser>
   [delete] Deleting directory <https://ci.phpmyadmin.net/job/phpMyAdmin/ws/build/coverage>
   [delete] Deleting directory <https://ci.phpmyadmin.net/job/phpMyAdmin/ws/build/logs>
   [delete] Deleting directory <https://ci.phpmyadmin.net/job/phpMyAdmin/ws/build/pdepend>
    [mkdir] Created dir: <https://ci.phpmyadmin.net/job/phpMyAdmin/ws/build/api>
    [mkdir] Created dir: <https://ci.phpmyadmin.net/job/phpMyAdmin/ws/build/code-browser>
    [mkdir] Created dir: <https://ci.phpmyadmin.net/job/phpMyAdmin/ws/build/coverage>
    [mkdir] Created dir: <https://ci.phpmyadmin.net/job/phpMyAdmin/ws/build/logs>
    [mkdir] Created dir: <https://ci.phpmyadmin.net/job/phpMyAdmin/ws/build/pdepend>

locales:
     [exec] po/en_GB.po:2664: a format specification for argument 1 doesn't exist in 'msgstr'
     [exec] msgfmt: found 1 fatal error
     [exec] tput: No value for $TERM and no -T specified
     [exec] Error when compiling po/en_GB.po
     [exec] tput: No value for $TERM and no -T specified

BUILD FAILED
<https://ci.phpmyadmin.net/job/phpMyAdmin/ws/build.xml>:140: exec returned: 1

Total time: 14 seconds
Build step 'Invoke Ant' marked build as failure
[CHECKSTYLE] Skipping publisher since build result is FAILURE
[JSLINT] Skipping publisher since build result is FAILURE
[PMD] Skipping publisher since build result is FAILURE
[DRY] Collecting duplicate code analysis files...
[DRY] Searching for all files in <https://ci.phpmyadmin.net/job/phpMyAdmin/ws/> that match the pattern build/logs/pmd-cpd.xml
[DRY] No files found. Configuration error?
[DRY] Computing warning deltas based on reference build #2290
[TASKS] Skipping publisher since build result is FAILURE
[ANALYSIS-COLLECTOR] Computing warning deltas based on reference build #2290
Recording plot data
Publishing Clover coverage report...
Clover xml file does not exist in: <https://ci.phpmyadmin.net/job/phpMyAdmin/ws/> called: build/logs/clover.xml and will not be copied to: /var/lib/jenkins/jobs/phpMyAdmin/builds/2291/cloverphp/clover.xml
Could not find 'build/coverage/build/logs/clover.xml'.  Did you generate the XML report for Clover?
[xUnit] [INFO] - Starting to record.
[xUnit] [INFO] - Processing PHPUnit-3.x (default)
[xUnit] [INFO] - [PHPUnit-3.x (default)] - No test report file(s) were found with the pattern 'build/logs/junit.xml' relative to '<https://ci.phpmyadmin.net/job/phpMyAdmin/ws/'> for the testing framework 'PHPUnit-3.x (default)'.  Did you enter a pattern relative to the correct directory?  Did you generate the result report(s) for 'PHPUnit-3.x (default)'?
[xUnit] [ERROR] - No test reports found for the metric 'PHPUnit' with the resolved pattern 'build/logs/junit.xml'. Configuration error?.
[xUnit] [INFO] - Failing BUILD.
[xUnit] [INFO] - There are errors when processing test results.
[xUnit] [INFO] - Skipping tests recording.
[xUnit] [INFO] - Stop build.
[JDepend] JDepend plugin is ready
[JDepend] Couldn't generate JDepend file at 'build/logs/jdepend.xml'java.nio.file.NoSuchFileException: <https://ci.phpmyadmin.net/job/phpMyAdmin/ws/build/logs/jdepend.xml>

_______________________________________________
Developers mailing list
[hidden email]
https://lists.phpmyadmin.net/mailman/listinfo/developers