[phpMyAdmin Developers] Build failed in Jenkins: phpMyAdmin #2120

classic Classic list List threaded Threaded
4 messages Options
Reply | Threaded
Open this post in threaded view
|

[phpMyAdmin Developers] Build failed in Jenkins: phpMyAdmin #2120

Jenkins Daemon
See <https://ci.phpmyadmin.net/job/phpMyAdmin/2120/display/redirect?page=changes>

Changes:

[weblate] Translated using Weblate (Chinese (Simplified))

[weblate] Translated using Weblate (Bengali)

[weblate] Translated using Weblate (Punjabi)

------------------------------------------
Started by timer
[EnvInject] - Loading node environment variables.
Building in workspace <https://ci.phpmyadmin.net/job/phpMyAdmin/ws/>
 > git rev-parse --is-inside-work-tree # timeout=10
Fetching changes from the remote Git repository
 > git config remote.origin.url https://github.com/phpmyadmin/phpmyadmin.git # timeout=10
Fetching upstream changes from https://github.com/phpmyadmin/phpmyadmin.git
 > git --version # timeout=10
 > git fetch --tags --progress https://github.com/phpmyadmin/phpmyadmin.git +refs/heads/*:refs/remotes/origin/*
 > git rev-parse origin/master^{commit} # timeout=10
Checking out Revision e90f56bb53bc7c74b51c658c929c5794620ff934 (origin/master)
 > git config core.sparsecheckout # timeout=10
 > git checkout -f e90f56bb53bc7c74b51c658c929c5794620ff934
 > git rev-list 027ca3d33d94ab2403a43c32fe874f7efd20d9bc # timeout=10
[EnvInject] - Executing scripts and injecting environment variables after the SCM step.
[EnvInject] - Injecting as environment variables the properties content
TESTSUITE_URL=http://ci-live.phpmyadmin.net/phpMyAdmin/workspace/
TESTSUITE_USER=pmatest
TESTSUITE_DATABASE=pmatest
XTESTSUITE_BROWSERSTACK_USER=michaliha
TESTSUITE_SERVER=localhost

[EnvInject] - Variables injected successfully.
[workspace] $ /bin/sh -xe /tmp/jenkins3751995246297122990.sh
+ composer update --no-interaction
Loading composer repositories with package information
Updating dependencies (including require-dev)
Nothing to install or update
Package guzzle/guzzle is abandoned, you should avoid using it. Use guzzlehttp/guzzle instead.
Generating autoload files
[workspace] $ ant ******** ******** clean locales phpunit pdepend phpmd phpcpd phpcs phploc jshint jshint-checkstyle lint
Unable to locate tools.jar. Expected to find it in /usr/lib/jvm/java-8-openjdk-amd64/lib/tools.jar
Buildfile: <https://ci.phpmyadmin.net/job/phpMyAdmin/ws/build.xml>

clean:
   [delete] Deleting directory <https://ci.phpmyadmin.net/job/phpMyAdmin/ws/build/api>
   [delete] Deleting directory <https://ci.phpmyadmin.net/job/phpMyAdmin/ws/build/code-browser>
   [delete] Deleting directory <https://ci.phpmyadmin.net/job/phpMyAdmin/ws/build/coverage>
   [delete] Deleting directory <https://ci.phpmyadmin.net/job/phpMyAdmin/ws/build/logs>
   [delete] Deleting directory <https://ci.phpmyadmin.net/job/phpMyAdmin/ws/build/pdepend>
    [mkdir] Created dir: <https://ci.phpmyadmin.net/job/phpMyAdmin/ws/build/api>
    [mkdir] Created dir: <https://ci.phpmyadmin.net/job/phpMyAdmin/ws/build/code-browser>
    [mkdir] Created dir: <https://ci.phpmyadmin.net/job/phpMyAdmin/ws/build/coverage>
    [mkdir] Created dir: <https://ci.phpmyadmin.net/job/phpMyAdmin/ws/build/logs>
    [mkdir] Created dir: <https://ci.phpmyadmin.net/job/phpMyAdmin/ws/build/pdepend>

locales:
     [exec] po/pa.po:41: 'msgstr' is not a valid PHP format string, unlike 'msgid'. Reason: The character that terminates the directive number 1 is not a valid conversion specifier.
     [exec] msgfmt: found 1 fatal error
     [exec] tput: No value for $TERM and no -T specified
     [exec] Error when compiling po/pa.po
     [exec] tput: No value for $TERM and no -T specified

BUILD FAILED
<https://ci.phpmyadmin.net/job/phpMyAdmin/ws/build.xml>:138: exec returned: 1

Total time: 13 seconds
Build step 'Invoke Ant' marked build as failure
[CHECKSTYLE] Skipping publisher since build result is FAILURE
[JSLINT] Skipping publisher since build result is FAILURE
[PMD] Skipping publisher since build result is FAILURE
[DRY] Collecting duplicate code analysis files...
[DRY] Searching for all files in <https://ci.phpmyadmin.net/job/phpMyAdmin/ws/> that match the pattern build/logs/pmd-cpd.xml
[DRY] No files found. Configuration error?
[DRY] Computing warning deltas based on reference build #2119
[TASKS] Skipping publisher since build result is FAILURE
[ANALYSIS-COLLECTOR] Computing warning deltas based on reference build #2119
Recording plot data
Publishing Clover coverage report...
Clover xml file does not exist in: <https://ci.phpmyadmin.net/job/phpMyAdmin/ws/> called: build/logs/clover.xml and will not be copied to: /var/lib/jenkins/jobs/phpMyAdmin/builds/2120/cloverphp/clover.xml
Could not find 'build/coverage/build/logs/clover.xml'.  Did you generate the XML report for Clover?
[xUnit] [INFO] - Starting to record.
[xUnit] [INFO] - Processing PHPUnit-3.x (default)
[xUnit] [INFO] - [PHPUnit-3.x (default)] - No test report file(s) were found with the pattern 'build/logs/junit.xml' relative to '<https://ci.phpmyadmin.net/job/phpMyAdmin/ws/'> for the testing framework 'PHPUnit-3.x (default)'.  Did you enter a pattern relative to the correct directory?  Did you generate the result report(s) for 'PHPUnit-3.x (default)'?
[xUnit] [ERROR] - No test reports found for the metric 'PHPUnit' with the resolved pattern 'build/logs/junit.xml'. Configuration error?.
[xUnit] [INFO] - Failing BUILD.
[xUnit] [INFO] - There are errors when processing test results.
[xUnit] [INFO] - Skipping tests recording.
[xUnit] [INFO] - Stop build.
[JDepend] JDepend plugin is ready
[JDepend] Couldn't generate JDepend file at 'build/logs/jdepend.xml'java.nio.file.NoSuchFileException: <https://ci.phpmyadmin.net/job/phpMyAdmin/ws/build/logs/jdepend.xml>

_______________________________________________
Developers mailing list
[hidden email]
https://lists.phpmyadmin.net/mailman/listinfo/developers
Reply | Threaded
Open this post in threaded view
|

[phpMyAdmin Developers] Build failed in Jenkins: phpMyAdmin #2121

Jenkins Daemon
See <https://ci.phpmyadmin.net/job/phpMyAdmin/2121/display/redirect>

------------------------------------------
Started by timer
[EnvInject] - Loading node environment variables.
Building in workspace <https://ci.phpmyadmin.net/job/phpMyAdmin/ws/>
 > git rev-parse --is-inside-work-tree # timeout=10
Fetching changes from the remote Git repository
 > git config remote.origin.url https://github.com/phpmyadmin/phpmyadmin.git # timeout=10
Fetching upstream changes from https://github.com/phpmyadmin/phpmyadmin.git
 > git --version # timeout=10
 > git fetch --tags --progress https://github.com/phpmyadmin/phpmyadmin.git +refs/heads/*:refs/remotes/origin/*
 > git rev-parse origin/master^{commit} # timeout=10
Checking out Revision e90f56bb53bc7c74b51c658c929c5794620ff934 (origin/master)
 > git config core.sparsecheckout # timeout=10
 > git checkout -f e90f56bb53bc7c74b51c658c929c5794620ff934
 > git rev-list e90f56bb53bc7c74b51c658c929c5794620ff934 # timeout=10
[EnvInject] - Executing scripts and injecting environment variables after the SCM step.
[EnvInject] - Injecting as environment variables the properties content
TESTSUITE_URL=http://ci-live.phpmyadmin.net/phpMyAdmin/workspace/
TESTSUITE_USER=pmatest
TESTSUITE_DATABASE=pmatest
XTESTSUITE_BROWSERSTACK_USER=michaliha
TESTSUITE_SERVER=localhost

[EnvInject] - Variables injected successfully.
[workspace] $ /bin/sh -xe /tmp/jenkins9006385519475324756.sh
+ composer update --no-interaction
Loading composer repositories with package information
Updating dependencies (including require-dev)
Nothing to install or update
Package guzzle/guzzle is abandoned, you should avoid using it. Use guzzlehttp/guzzle instead.
Generating autoload files
[workspace] $ ant ******** ******** clean locales phpunit pdepend phpmd phpcpd phpcs phploc jshint jshint-checkstyle lint
Unable to locate tools.jar. Expected to find it in /usr/lib/jvm/java-8-openjdk-amd64/lib/tools.jar
Buildfile: <https://ci.phpmyadmin.net/job/phpMyAdmin/ws/build.xml>

clean:
   [delete] Deleting directory <https://ci.phpmyadmin.net/job/phpMyAdmin/ws/build/api>
   [delete] Deleting directory <https://ci.phpmyadmin.net/job/phpMyAdmin/ws/build/code-browser>
   [delete] Deleting directory <https://ci.phpmyadmin.net/job/phpMyAdmin/ws/build/coverage>
   [delete] Deleting directory <https://ci.phpmyadmin.net/job/phpMyAdmin/ws/build/logs>
   [delete] Deleting directory <https://ci.phpmyadmin.net/job/phpMyAdmin/ws/build/pdepend>
    [mkdir] Created dir: <https://ci.phpmyadmin.net/job/phpMyAdmin/ws/build/api>
    [mkdir] Created dir: <https://ci.phpmyadmin.net/job/phpMyAdmin/ws/build/code-browser>
    [mkdir] Created dir: <https://ci.phpmyadmin.net/job/phpMyAdmin/ws/build/coverage>
    [mkdir] Created dir: <https://ci.phpmyadmin.net/job/phpMyAdmin/ws/build/logs>
    [mkdir] Created dir: <https://ci.phpmyadmin.net/job/phpMyAdmin/ws/build/pdepend>

locales:
     [exec] po/pa.po:41: 'msgstr' is not a valid PHP format string, unlike 'msgid'. Reason: The character that terminates the directive number 1 is not a valid conversion specifier.
     [exec] msgfmt: found 1 fatal error
     [exec] tput: No value for $TERM and no -T specified
     [exec] Error when compiling po/pa.po
     [exec] tput: No value for $TERM and no -T specified

BUILD FAILED
<https://ci.phpmyadmin.net/job/phpMyAdmin/ws/build.xml>:138: exec returned: 1

Total time: 11 seconds
Build step 'Invoke Ant' marked build as failure
[CHECKSTYLE] Skipping publisher since build result is FAILURE
[JSLINT] Skipping publisher since build result is FAILURE
[PMD] Skipping publisher since build result is FAILURE
[DRY] Collecting duplicate code analysis files...
[DRY] Searching for all files in <https://ci.phpmyadmin.net/job/phpMyAdmin/ws/> that match the pattern build/logs/pmd-cpd.xml
[DRY] No files found. Configuration error?
[DRY] Computing warning deltas based on reference build #2119
[TASKS] Skipping publisher since build result is FAILURE
[ANALYSIS-COLLECTOR] Computing warning deltas based on reference build #2119
Recording plot data
Publishing Clover coverage report...
Clover xml file does not exist in: <https://ci.phpmyadmin.net/job/phpMyAdmin/ws/> called: build/logs/clover.xml and will not be copied to: /var/lib/jenkins/jobs/phpMyAdmin/builds/2121/cloverphp/clover.xml
Could not find 'build/coverage/build/logs/clover.xml'.  Did you generate the XML report for Clover?
[xUnit] [INFO] - Starting to record.
[xUnit] [INFO] - Processing PHPUnit-3.x (default)
[xUnit] [INFO] - [PHPUnit-3.x (default)] - No test report file(s) were found with the pattern 'build/logs/junit.xml' relative to '<https://ci.phpmyadmin.net/job/phpMyAdmin/ws/'> for the testing framework 'PHPUnit-3.x (default)'.  Did you enter a pattern relative to the correct directory?  Did you generate the result report(s) for 'PHPUnit-3.x (default)'?
[xUnit] [ERROR] - No test reports found for the metric 'PHPUnit' with the resolved pattern 'build/logs/junit.xml'. Configuration error?.
[xUnit] [INFO] - Failing BUILD.
[xUnit] [INFO] - There are errors when processing test results.
[xUnit] [INFO] - Skipping tests recording.
[xUnit] [INFO] - Stop build.
[JDepend] JDepend plugin is ready
[JDepend] Couldn't generate JDepend file at 'build/logs/jdepend.xml'java.nio.file.NoSuchFileException: <https://ci.phpmyadmin.net/job/phpMyAdmin/ws/build/logs/jdepend.xml>

_______________________________________________
Developers mailing list
[hidden email]
https://lists.phpmyadmin.net/mailman/listinfo/developers
Reply | Threaded
Open this post in threaded view
|

[phpMyAdmin Developers] Build failed in Jenkins: phpMyAdmin #2122

Jenkins Daemon
See <https://ci.phpmyadmin.net/job/phpMyAdmin/2122/display/redirect?page=changes>

Changes:

[weblate] Translated using Weblate (Persian)

------------------------------------------
Started by timer
[EnvInject] - Loading node environment variables.
Building in workspace <https://ci.phpmyadmin.net/job/phpMyAdmin/ws/>
 > git rev-parse --is-inside-work-tree # timeout=10
Fetching changes from the remote Git repository
 > git config remote.origin.url https://github.com/phpmyadmin/phpmyadmin.git # timeout=10
Fetching upstream changes from https://github.com/phpmyadmin/phpmyadmin.git
 > git --version # timeout=10
 > git fetch --tags --progress https://github.com/phpmyadmin/phpmyadmin.git +refs/heads/*:refs/remotes/origin/*
 > git rev-parse origin/master^{commit} # timeout=10
Checking out Revision e5439795d75353f081a87a7988966cb3cc0d230b (origin/master)
 > git config core.sparsecheckout # timeout=10
 > git checkout -f e5439795d75353f081a87a7988966cb3cc0d230b
 > git rev-list e90f56bb53bc7c74b51c658c929c5794620ff934 # timeout=10
[EnvInject] - Executing scripts and injecting environment variables after the SCM step.
[EnvInject] - Injecting as environment variables the properties content
TESTSUITE_URL=http://ci-live.phpmyadmin.net/phpMyAdmin/workspace/
TESTSUITE_USER=pmatest
TESTSUITE_DATABASE=pmatest
XTESTSUITE_BROWSERSTACK_USER=michaliha
TESTSUITE_SERVER=localhost

[EnvInject] - Variables injected successfully.
[workspace] $ /bin/sh -xe /tmp/jenkins5301347688998554064.sh
+ composer update --no-interaction
Loading composer repositories with package information
Updating dependencies (including require-dev)
  - Installing psr/simple-cache (1.0.0)
    Loading from cache

  - Removing symfony/cache (v3.2.8)
  - Installing symfony/cache (v3.3.0)
    Loading from cache

  - Removing symfony/expression-language (v3.2.8)
  - Installing symfony/expression-language (v3.3.0)
    Loading from cache

  - Removing symfony/filesystem (v3.2.8)
  - Installing symfony/filesystem (v3.3.0)
    Loading from cache

  - Removing symfony/config (v3.2.8)
  - Installing symfony/config (v3.3.0)
    Loading from cache

  - Removing symfony/debug (v3.2.8)
  - Installing symfony/debug (v3.3.0)
    Loading from cache

  - Removing symfony/console (v3.2.8)
  - Installing symfony/console (v3.3.0)
    Loading from cache

  - Removing symfony/stopwatch (v3.2.8)
  - Installing symfony/stopwatch (v3.3.0)
    Loading from cache

  - Removing symfony/yaml (v3.2.8)
  - Installing symfony/yaml (v3.3.0)
    Loading from cache

  - Removing symfony/event-dispatcher (v2.8.20)
  - Installing symfony/event-dispatcher (v2.8.21)
    Loading from cache

  - Removing symfony/process (v3.2.8)
  - Installing symfony/process (v3.3.0)
    Loading from cache

Package guzzle/guzzle is abandoned, you should avoid using it. Use guzzlehttp/guzzle instead.
Writing lock file
Generating autoload files
[workspace] $ ant ******** ******** clean locales phpunit pdepend phpmd phpcpd phpcs phploc jshint jshint-checkstyle lint
Unable to locate tools.jar. Expected to find it in /usr/lib/jvm/java-8-openjdk-amd64/lib/tools.jar
Buildfile: <https://ci.phpmyadmin.net/job/phpMyAdmin/ws/build.xml>

clean:
   [delete] Deleting directory <https://ci.phpmyadmin.net/job/phpMyAdmin/ws/build/api>
   [delete] Deleting directory <https://ci.phpmyadmin.net/job/phpMyAdmin/ws/build/code-browser>
   [delete] Deleting directory <https://ci.phpmyadmin.net/job/phpMyAdmin/ws/build/coverage>
   [delete] Deleting directory <https://ci.phpmyadmin.net/job/phpMyAdmin/ws/build/logs>
   [delete] Deleting directory <https://ci.phpmyadmin.net/job/phpMyAdmin/ws/build/pdepend>
    [mkdir] Created dir: <https://ci.phpmyadmin.net/job/phpMyAdmin/ws/build/api>
    [mkdir] Created dir: <https://ci.phpmyadmin.net/job/phpMyAdmin/ws/build/code-browser>
    [mkdir] Created dir: <https://ci.phpmyadmin.net/job/phpMyAdmin/ws/build/coverage>
    [mkdir] Created dir: <https://ci.phpmyadmin.net/job/phpMyAdmin/ws/build/logs>
    [mkdir] Created dir: <https://ci.phpmyadmin.net/job/phpMyAdmin/ws/build/pdepend>

locales:
     [exec] po/pa.po:41: 'msgstr' is not a valid PHP format string, unlike 'msgid'. Reason: The character that terminates the directive number 1 is not a valid conversion specifier.
     [exec] msgfmt: found 1 fatal error
     [exec] tput: No value for $TERM and no -T specified
     [exec] Error when compiling po/pa.po
     [exec] tput: No value for $TERM and no -T specified

BUILD FAILED
<https://ci.phpmyadmin.net/job/phpMyAdmin/ws/build.xml>:138: exec returned: 1

Total time: 24 seconds
Build step 'Invoke Ant' marked build as failure
[CHECKSTYLE] Skipping publisher since build result is FAILURE
[JSLINT] Skipping publisher since build result is FAILURE
[PMD] Skipping publisher since build result is FAILURE
[DRY] Collecting duplicate code analysis files...
[DRY] Searching for all files in <https://ci.phpmyadmin.net/job/phpMyAdmin/ws/> that match the pattern build/logs/pmd-cpd.xml
[DRY] No files found. Configuration error?
[DRY] Computing warning deltas based on reference build #2119
[TASKS] Skipping publisher since build result is FAILURE
[ANALYSIS-COLLECTOR] Computing warning deltas based on reference build #2119
Recording plot data
Publishing Clover coverage report...
Clover xml file does not exist in: <https://ci.phpmyadmin.net/job/phpMyAdmin/ws/> called: build/logs/clover.xml and will not be copied to: /var/lib/jenkins/jobs/phpMyAdmin/builds/2122/cloverphp/clover.xml
Could not find 'build/coverage/build/logs/clover.xml'.  Did you generate the XML report for Clover?
[xUnit] [INFO] - Starting to record.
[xUnit] [INFO] - Processing PHPUnit-3.x (default)
[xUnit] [INFO] - [PHPUnit-3.x (default)] - No test report file(s) were found with the pattern 'build/logs/junit.xml' relative to '<https://ci.phpmyadmin.net/job/phpMyAdmin/ws/'> for the testing framework 'PHPUnit-3.x (default)'.  Did you enter a pattern relative to the correct directory?  Did you generate the result report(s) for 'PHPUnit-3.x (default)'?
[xUnit] [ERROR] - No test reports found for the metric 'PHPUnit' with the resolved pattern 'build/logs/junit.xml'. Configuration error?.
[xUnit] [INFO] - Failing BUILD.
[xUnit] [INFO] - There are errors when processing test results.
[xUnit] [INFO] - Skipping tests recording.
[xUnit] [INFO] - Stop build.
[JDepend] JDepend plugin is ready
[JDepend] Couldn't generate JDepend file at 'build/logs/jdepend.xml'java.nio.file.NoSuchFileException: <https://ci.phpmyadmin.net/job/phpMyAdmin/ws/build/logs/jdepend.xml>

_______________________________________________
Developers mailing list
[hidden email]
https://lists.phpmyadmin.net/mailman/listinfo/developers
Reply | Threaded
Open this post in threaded view
|

[phpMyAdmin Developers] Build failed in Jenkins: phpMyAdmin #2123

Jenkins Daemon
See <https://ci.phpmyadmin.net/job/phpMyAdmin/2123/display/redirect?page=changes>

Changes:

[weblate] Translated using Weblate (Belarusian)

------------------------------------------
Started by timer
[EnvInject] - Loading node environment variables.
Building in workspace <https://ci.phpmyadmin.net/job/phpMyAdmin/ws/>
 > git rev-parse --is-inside-work-tree # timeout=10
Fetching changes from the remote Git repository
 > git config remote.origin.url https://github.com/phpmyadmin/phpmyadmin.git # timeout=10
Fetching upstream changes from https://github.com/phpmyadmin/phpmyadmin.git
 > git --version # timeout=10
 > git fetch --tags --progress https://github.com/phpmyadmin/phpmyadmin.git +refs/heads/*:refs/remotes/origin/*
 > git rev-parse origin/master^{commit} # timeout=10
Checking out Revision 6807c8fa71ca64607e71bd87b1b2fa80674a3825 (origin/master)
 > git config core.sparsecheckout # timeout=10
 > git checkout -f 6807c8fa71ca64607e71bd87b1b2fa80674a3825
 > git rev-list e5439795d75353f081a87a7988966cb3cc0d230b # timeout=10
[EnvInject] - Executing scripts and injecting environment variables after the SCM step.
[EnvInject] - Injecting as environment variables the properties content
TESTSUITE_URL=http://ci-live.phpmyadmin.net/phpMyAdmin/workspace/
TESTSUITE_USER=pmatest
TESTSUITE_DATABASE=pmatest
XTESTSUITE_BROWSERSTACK_USER=michaliha
TESTSUITE_SERVER=localhost

[EnvInject] - Variables injected successfully.
[workspace] $ /bin/sh -xe /tmp/jenkins8741722367596988910.sh
+ composer update --no-interaction
Loading composer repositories with package information
Updating dependencies (including require-dev)
Nothing to install or update
Package guzzle/guzzle is abandoned, you should avoid using it. Use guzzlehttp/guzzle instead.
Generating autoload files
[workspace] $ ant ******** ******** clean locales phpunit pdepend phpmd phpcpd phpcs phploc jshint jshint-checkstyle lint
Unable to locate tools.jar. Expected to find it in /usr/lib/jvm/java-8-openjdk-amd64/lib/tools.jar
Buildfile: <https://ci.phpmyadmin.net/job/phpMyAdmin/ws/build.xml>

clean:
   [delete] Deleting directory <https://ci.phpmyadmin.net/job/phpMyAdmin/ws/build/api>
   [delete] Deleting directory <https://ci.phpmyadmin.net/job/phpMyAdmin/ws/build/code-browser>
   [delete] Deleting directory <https://ci.phpmyadmin.net/job/phpMyAdmin/ws/build/coverage>
   [delete] Deleting directory <https://ci.phpmyadmin.net/job/phpMyAdmin/ws/build/logs>
   [delete] Deleting directory <https://ci.phpmyadmin.net/job/phpMyAdmin/ws/build/pdepend>
    [mkdir] Created dir: <https://ci.phpmyadmin.net/job/phpMyAdmin/ws/build/api>
    [mkdir] Created dir: <https://ci.phpmyadmin.net/job/phpMyAdmin/ws/build/code-browser>
    [mkdir] Created dir: <https://ci.phpmyadmin.net/job/phpMyAdmin/ws/build/coverage>
    [mkdir] Created dir: <https://ci.phpmyadmin.net/job/phpMyAdmin/ws/build/logs>
    [mkdir] Created dir: <https://ci.phpmyadmin.net/job/phpMyAdmin/ws/build/pdepend>

locales:
     [exec] po/pa.po:41: 'msgstr' is not a valid PHP format string, unlike 'msgid'. Reason: The character that terminates the directive number 1 is not a valid conversion specifier.
     [exec] msgfmt: found 1 fatal error
     [exec] tput: No value for $TERM and no -T specified
     [exec] Error when compiling po/pa.po
     [exec] tput: No value for $TERM and no -T specified

BUILD FAILED
<https://ci.phpmyadmin.net/job/phpMyAdmin/ws/build.xml>:138: exec returned: 1

Total time: 13 seconds
Build step 'Invoke Ant' marked build as failure
[CHECKSTYLE] Skipping publisher since build result is FAILURE
[JSLINT] Skipping publisher since build result is FAILURE
[PMD] Skipping publisher since build result is FAILURE
[DRY] Collecting duplicate code analysis files...
[DRY] Searching for all files in <https://ci.phpmyadmin.net/job/phpMyAdmin/ws/> that match the pattern build/logs/pmd-cpd.xml
[DRY] No files found. Configuration error?
[DRY] Computing warning deltas based on reference build #2119
[TASKS] Skipping publisher since build result is FAILURE
[ANALYSIS-COLLECTOR] Computing warning deltas based on reference build #2119
Recording plot data
Publishing Clover coverage report...
Clover xml file does not exist in: <https://ci.phpmyadmin.net/job/phpMyAdmin/ws/> called: build/logs/clover.xml and will not be copied to: /var/lib/jenkins/jobs/phpMyAdmin/builds/2123/cloverphp/clover.xml
Could not find 'build/coverage/build/logs/clover.xml'.  Did you generate the XML report for Clover?
[xUnit] [INFO] - Starting to record.
[xUnit] [INFO] - Processing PHPUnit-3.x (default)
[xUnit] [INFO] - [PHPUnit-3.x (default)] - No test report file(s) were found with the pattern 'build/logs/junit.xml' relative to '<https://ci.phpmyadmin.net/job/phpMyAdmin/ws/'> for the testing framework 'PHPUnit-3.x (default)'.  Did you enter a pattern relative to the correct directory?  Did you generate the result report(s) for 'PHPUnit-3.x (default)'?
[xUnit] [ERROR] - No test reports found for the metric 'PHPUnit' with the resolved pattern 'build/logs/junit.xml'. Configuration error?.
[xUnit] [INFO] - Failing BUILD.
[xUnit] [INFO] - There are errors when processing test results.
[xUnit] [INFO] - Skipping tests recording.
[xUnit] [INFO] - Stop build.
[JDepend] JDepend plugin is ready
[JDepend] Couldn't generate JDepend file at 'build/logs/jdepend.xml'java.nio.file.NoSuchFileException: <https://ci.phpmyadmin.net/job/phpMyAdmin/ws/build/logs/jdepend.xml>

_______________________________________________
Developers mailing list
[hidden email]
https://lists.phpmyadmin.net/mailman/listinfo/developers